BDBM50101187 2-(2-(3,5-Dimethyl-phenyl)-3-{2-[4-(4-methanesulfonylamino-phenyl)-butylamino]-ethyl}-1H-indol-5-yl)-N,N-dimethyl-isobutyramide::CHEMBL297918
SMILES: CN(C)C(=O)C(C)(C)c1ccc2[nH]c(c(CCNCCCCc3ccc(NS(C)(=O)=O)cc3)c2c1)-c1cc(C)cc(C)c1
InChI Key: InChIKey=QOOQBRRRNZUAKS-UHFFFAOYSA-N
Data: 3 IC50
Activity Spreadsheet -- Enzyme Inhibition Constant Data from BindingDB
Found 3 hits for monomerid = 50101187
Trg + Lig
Ki
nM
ΔG°
kcal/mole
IC50
nM
Kd
nM
EC50/IC50
nM
koff
s-1
kon
M-1s-1
pHTemp
°C
Gonadotropin-releasing hormone receptor
(Rattus norvegicus)
BDBM50101187
(2-(2-(3,5-Dimethyl-phenyl)-3-{2-[4-(4-methanesulfo...)
Show SMILES CN(C)C(=O)C(C)(C)c1ccc2[nH]c(c(CCNCCCCc3ccc(NS(C)(=O)=O)cc3)c2c1)-c1cc(C)cc(C)c1
Show InChI InChI=1S/C35H46N4O3S/c1-24-20-25(2)22-27(21-24)33-30(31-23-28(13-16-32(31)37-33)35(3,4)34(40)39(5)6)17-19-36-18-9-8-10-26-11-14-29(15-12-26)38-43(7,41)42/h11-16,20-23,36-38H,8-10,17-19H2,1-7H3
n/an/a 3n/an/an/an/an/an/a
Merck Research Laboratories
Curated by ChEMBL
Assay Description
Inhibition GnRH-stimulated luteinizing hormone (LH) release from rat pituitary cells
Bioorg Med Chem Lett 11: 1723-6 (2001)
BindingDB Entry DOI: 10.7270/Q2KH0MK4
Gonadotropin-releasing hormone receptor
(Rattus norvegicus)
BDBM50101187
(2-(2-(3,5-Dimethyl-phenyl)-3-{2-[4-(4-methanesulfo...)
Show SMILES CN(C)C(=O)C(C)(C)c1ccc2[nH]c(c(CCNCCCCc3ccc(NS(C)(=O)=O)cc3)c2c1)-c1cc(C)cc(C)c1
Show InChI InChI=1S/C35H46N4O3S/c1-24-20-25(2)22-27(21-24)33-30(31-23-28(13-16-32(31)37-33)35(3,4)34(40)39(5)6)17-19-36-18-9-8-10-26-11-14-29(15-12-26)38-43(7,41)42/h11-16,20-23,36-38H,8-10,17-19H2,1-7H3
n/an/a 0.100n/an/an/an/an/an/a
Merck Research Laboratories
Curated by ChEMBL
Assay Description
Inhibition of [125I]-buserelin binding to rat pituitary Gonadotropin-releasing hormone receptor, in the presence of 0.1% bovine serum albumin.
Bioorg Med Chem Lett 11: 1723-6 (2001)
BindingDB Entry DOI: 10.7270/Q2KH0MK4
Gonadotropin-releasing hormone receptor
(Rattus norvegicus)
BDBM50101187
(2-(2-(3,5-Dimethyl-phenyl)-3-{2-[4-(4-methanesulfo...)
Show SMILES CN(C)C(=O)C(C)(C)c1ccc2[nH]c(c(CCNCCCCc3ccc(NS(C)(=O)=O)cc3)c2c1)-c1cc(C)cc(C)c1
Show InChI InChI=1S/C35H46N4O3S/c1-24-20-25(2)22-27(21-24)33-30(31-23-28(13-16-32(31)37-33)35(3,4)34(40)39(5)6)17-19-36-18-9-8-10-26-11-14-29(15-12-26)38-43(7,41)42/h11-16,20-23,36-38H,8-10,17-19H2,1-7H3
n/an/a 160n/an/an/an/an/an/a
Merck Research Laboratories
Curated by ChEMBL
Assay Description
Binding affinity for wild type Src SH2 domain using BIAcore binding assay
Bioorg Med Chem Lett 11: 1723-6 (2001)
BindingDB Entry DOI: 10.7270/Q2KH0MK4