null
SMILES: CCN(CC)C(=O)Cc1ccc2[nH]c(c(CCNCCCCc3ccc(NS(C)(=O)=O)cc3)c2c1)-c1cc(C)cc(C)c1
InChI Key: InChIKey=LXGZLTJGKXGDER-UHFFFAOYSA-N
Activity Spreadsheet -- Enzyme Inhibition Constant Data from BindingDB
Found 3 hits for monomerid = 50101194
Trg + Lig
Ki
nM
ΔG°
kcal/mole
IC50
nM
Kd
nM
EC50/IC50
nM
koff
s-1
kon
M-1s-1
pHTemp
°C
Gonadotropin-releasing hormone receptor
(Rattus norvegicus)
BDBM50101194
(2-(2-(3,5-Dimethyl-phenyl)-3-{2-[4-(4-methanesulfo...)
Show SMILES CCN(CC)C(=O)Cc1ccc2[nH]c(c(CCNCCCCc3ccc(NS(C)(=O)=O)cc3)c2c1)-c1cc(C)cc(C)c1
Show InChI InChI=1S/C35H46N4O3S/c1-6-39(7-2)34(40)24-28-13-16-33-32(23-28)31(35(37-33)29-21-25(3)20-26(4)22-29)17-19-36-18-9-8-10-27-11-14-30(15-12-27)38-43(5,41)42/h11-16,20-23,36-38H,6-10,17-19,24H2,1-5H3
n/an/a 130n/an/an/an/an/an/a
Merck Research Laboratories
Curated by ChEMBL
Assay Description
Inhibition GnRH-stimulated luteinizing hormone (LH) release from rat pituitary cells
Bioorg Med Chem Lett 11: 1723-6 (2001)
BindingDB Entry DOI: 10.7270/Q2KH0MK4
Gonadotropin-releasing hormone receptor
(Rattus norvegicus)
BDBM50101194
(2-(2-(3,5-Dimethyl-phenyl)-3-{2-[4-(4-methanesulfo...)
Show SMILES CCN(CC)C(=O)Cc1ccc2[nH]c(c(CCNCCCCc3ccc(NS(C)(=O)=O)cc3)c2c1)-c1cc(C)cc(C)c1
Show InChI InChI=1S/C35H46N4O3S/c1-6-39(7-2)34(40)24-28-13-16-33-32(23-28)31(35(37-33)29-21-25(3)20-26(4)22-29)17-19-36-18-9-8-10-27-11-14-30(15-12-27)38-43(5,41)42/h11-16,20-23,36-38H,6-10,17-19,24H2,1-5H3
n/an/a 0.200n/an/an/an/an/an/a
Merck Research Laboratories
Curated by ChEMBL
Assay Description
Inhibition of [125I]-buserelin binding to rat pituitary Gonadotropin-releasing hormone receptor, in the presence of 0.1% bovine serum albumin.
Bioorg Med Chem Lett 11: 1723-6 (2001)
BindingDB Entry DOI: 10.7270/Q2KH0MK4
Gonadotropin-releasing hormone receptor
(Rattus norvegicus)
BDBM50101194
(2-(2-(3,5-Dimethyl-phenyl)-3-{2-[4-(4-methanesulfo...)
Show SMILES CCN(CC)C(=O)Cc1ccc2[nH]c(c(CCNCCCCc3ccc(NS(C)(=O)=O)cc3)c2c1)-c1cc(C)cc(C)c1
Show InChI InChI=1S/C35H46N4O3S/c1-6-39(7-2)34(40)24-28-13-16-33-32(23-28)31(35(37-33)29-21-25(3)20-26(4)22-29)17-19-36-18-9-8-10-27-11-14-30(15-12-27)38-43(5,41)42/h11-16,20-23,36-38H,6-10,17-19,24H2,1-5H3
n/an/a 3n/an/an/an/an/an/a
Merck Research Laboratories
Curated by ChEMBL
Assay Description
Inhibition of [125I]-buserelin binding to rat pituitary Gonadotropin-releasing hormone receptor, in the absence of bovine serum albumin (BSA)
Bioorg Med Chem Lett 11: 1723-6 (2001)
BindingDB Entry DOI: 10.7270/Q2KH0MK4