BDBM50101595 (3-Carboxy-2-nonylcarbamoyloxy-propyl)-trimethyl-phosphonium::CHEMBL311428
SMILES: CCCCCCCCCNC(=O)OC(CC([O-])=O)C[P+](C)(C)C
InChI Key: InChIKey=VCKHYLWSIQZYNI-UHFFFAOYSA-N
Data: 1 IC50
Activity Spreadsheet -- Enzyme Inhibition Constant Data from BindingDB
Found 1 hit for monomerid = 50101595
Trg + Lig
Ki
nM
ΔG°
kcal/mole
IC50
nM
Kd
nM
EC50/IC50
nM
koff
s-1
kon
M-1s-1
pHTemp
°C
Carnitine palmitoyltransferase 1A
(Rattus norvegicus)
BDBM50101595
((3-Carboxy-2-nonylcarbamoyloxy-propyl)-trimethyl-p...)
Show SMILES CCCCCCCCCNC(=O)OC(CC([O-])=O)C[P+](C)(C)C
Show InChI InChI=1S/C17H34NO4P/c1-5-6-7-8-9-10-11-12-18-17(21)22-15(13-16(19)20)14-23(2,3)4/h15H,5-14H2,1-4H3,(H-,18,19,20,21)
Reactome pathway
n/an/a>3.00E+5n/an/an/an/an/an/a
Sigma Tau Pharmaceutical Industries S.p.A.
Curated by ChEMBL
Assay Description
Inhibition of rat liver mitochondrial carnitine palmitoyltransferase 1 using [14C]-palmitoyl-CoA radioligand
J Med Chem 44: 2383-6 (2001)
BindingDB Entry DOI: 10.7270/Q2930SG7