BDBM50101812 HEPTAMINOL::Heptaminol
SMILES: CC(N)CCCC(C)(C)O
InChI Key: InChIKey=LREQLEBVOXIEOM-UHFFFAOYSA-N
Data: 1 IC50
Activity Spreadsheet -- Enzyme Inhibition Constant Data from BindingDB
Found 1 hit for monomerid = 50101812
Trg + Lig
Ki
nM
ΔG°
kcal/mole
IC50
nM
Kd
nM
EC50/IC50
nM
koff
s-1
kon
M-1s-1
pHTemp
°C
Voltage-dependent L-type calcium channel subunit alpha-1C
(Cavia porcellus)
BDBM50101812
(HEPTAMINOL | Heptaminol)
Show SMILES CC(N)CCCC(C)(C)O
Show InChI InChI=1S/C8H19NO/c1-7(9)5-4-6-8(2,3)10/h7,10H,4-6,9H2,1-3H3
n/an/a 1.53E+4n/an/an/an/an/an/a
Jagiellonian University
Curated by ChEMBL
Assay Description
Inhibition of L-type calcium channel measured using whole-cell patch clamp in guinea pig ventricular myocytes
J Appl Toxicol 32: 858-66 (2012)
Article DOI: 10.1002/jat.2784
BindingDB Entry DOI: 10.7270/Q2D79D5C