BDBM50101982 CHEMBL3398162
SMILES: CC(=O)c1ccccc1NS(=O)(=O)c1ccc(NS(=O)C(C)(C)C)cc1
InChI Key: InChIKey=BUTDAKFMSUKQHY-UHFFFAOYSA-N
Data: 3 IC50
Activity Spreadsheet -- Enzyme Inhibition Constant Data from BindingDB
Found 3 hits for monomerid = 50101982
Trg + Lig
Ki
nM
ΔG°
kcal/mole
IC50
nM
Kd
nM
EC50/IC50
nM
koff
s-1
kon
M-1s-1
pHTemp
°C
Cathepsin G
(Homo sapiens (Human))
BDBM50101982
(CHEMBL3398162)
Show SMILES CC(=O)c1ccccc1NS(=O)(=O)c1ccc(NS(=O)C(C)(C)C)cc1
Show InChI InChI=1S/C18H22N2O4S2/c1-13(21)16-7-5-6-8-17(16)20-26(23,24)15-11-9-14(10-12-15)19-25(22)18(2,3)4/h5-12,19-20H,1-4H3
NCI pathway
Reactome pathway
n/an/a>1n/an/an/an/an/an/a
Chang Gung University
Curated by ChEMBL
Assay Description
Inhibition of human cathepsin G using N-succinyl-Ala-Ala-Pro-Phe-p-nitroanilide as substrate measured for 180 mins by spectrophotometry
Bioorg Med Chem 23: 1123-34 (2015)
Article DOI: 10.1016/j.bmc.2014.12.056
BindingDB Entry DOI: 10.7270/Q2CJ8G5M
Leukocyte elastase
(Homo sapiens (Human))
BDBM50101982
(CHEMBL3398162)
Show SMILES CC(=O)c1ccccc1NS(=O)(=O)c1ccc(NS(=O)C(C)(C)C)cc1
Show InChI InChI=1S/C18H22N2O4S2/c1-13(21)16-7-5-6-8-17(16)20-26(23,24)15-11-9-14(10-12-15)19-25(22)18(2,3)4/h5-12,19-20H,1-4H3
Reactome pathway
n/an/a>1n/an/an/an/an/an/a
Chang Gung University
Curated by ChEMBL
Assay Description
Inhibition of human neutrophil elastase measured for 30 mins by spectrophotometry
Bioorg Med Chem 23: 1123-34 (2015)
Article DOI: 10.1016/j.bmc.2014.12.056
BindingDB Entry DOI: 10.7270/Q2CJ8G5M
Leukocyte proteinase 3
(Homo sapiens (Human))
BDBM50101982
(CHEMBL3398162)
Show SMILES CC(=O)c1ccccc1NS(=O)(=O)c1ccc(NS(=O)C(C)(C)C)cc1
Show InChI InChI=1S/C18H22N2O4S2/c1-13(21)16-7-5-6-8-17(16)20-26(23,24)15-11-9-14(10-12-15)19-25(22)18(2,3)4/h5-12,19-20H,1-4H3
NCI pathway
Reactome pathway
n/an/a>1n/an/an/an/an/an/a
Chang Gung University
Curated by ChEMBL
Assay Description
Inhibition of Pr3 (unknown origin) using t-butyloxycarbonyl-Ala-Ala-Nva-thiobenzyl ester as substrate measured for 180 mins by spectrophotometry
Bioorg Med Chem 23: 1123-34 (2015)
Article DOI: 10.1016/j.bmc.2014.12.056
BindingDB Entry DOI: 10.7270/Q2CJ8G5M