BDBM50102042 CHEMBL2373000::Derivative of T140 peptide
SMILES: [H][C@]12[#6]-[#6]-[#6]-[#7]1-[#6](=O)-[#6@H](-[#6]-[#6]-[#6]-[#6]-[#7])-[#7]-[#6](=O)-[#6@@H](-[#6]-[#6]-[#6]-[#6]-[#7])-[#7]-[#6](=O)-[#6@H](-[#6]-[#6]-[#6]-[#7]-[#6](-[#7])=O)-[#7]-[#6](=O)-[#6@@H](-[#6]-c1ccc(-[#8])cc1)-[#7]-[#6](=O)-[#6@@H](-[#6]-[#16]-[#16]-[#6]-[#6@@H](-[#7]-[#6](=O)-[#6@H](-[#6]-[#6]-[#6]-[#7]-[#6](-[#7])=O)-[#7]-[#6](=O)-[#6@H](-[#6]-[#6]-[#6]\[#7]=[#6](\[#7])-[#7])-[#7]-[#6](=O)-[#6@H](-[#6]-c1ccc(-[#8])cc1)-[#7]-[#6]2=O)-[#6](=O)-[#7]-[#6@@H](-[#6]-[#6]-[#6]\[#7]=[#6](\[#7])-[#7])-[#6](-[#8])=O)-[#7]-[#6](=O)-[#6@@H](-[#7]-[#6](=O)-[#6@H](-[#6]-[#6]-[#6]\[#7]=[#6](\[#7])-[#7])-[#7]-[#6](=O)-[#6@@H](-[#7])-[#6]-[#6]-[#6]-[#7]-[#6](-[#7])=O)-c1ccc2ccccc2c1
InChI Key: InChIKey=PDFUFRMIMYGZRP-UHMPCPRASA-N
Data: 1 EC50
Activity Spreadsheet -- Enzyme Inhibition Constant Data from BindingDB
Found 1 hit for monomerid = 50102042
Trg + Lig
Ki
nM
ΔG°
kcal/mole
IC50
nM
Kd
nM
EC50/IC50
nM
koff
s-1
kon
M-1s-1
pHTemp
°C
C-X-C chemokine receptor type 4 (CXCR4)
(Homo sapiens (Human))
BDBM50102042
(CHEMBL2373000 | Derivative of T140 peptide)
Show SMILES [H][C@]12[#6]-[#6]-[#6]-[#7]1-[#6](=O)-[#6@H](-[#6]-[#6]-[#6]-[#6]-[#7])-[#7]-[#6](=O)-[#6@@H](-[#6]-[#6]-[#6]-[#6]-[#7])-[#7]-[#6](=O)-[#6@H](-[#6]-[#6]-[#6]-[#7]-[#6](-[#7])=O)-[#7]-[#6](=O)-[#6@@H](-[#6]-c1ccc(-[#8])cc1)-[#7]-[#6](=O)-[#6@@H](-[#6]-[#16]-[#16]-[#6]-[#6@@H](-[#7]-[#6](=O)-[#6@H](-[#6]-[#6]-[#6]-[#7]-[#6](-[#7])=O)-[#7]-[#6](=O)-[#6@H](-[#6]-[#6]-[#6]\[#7]=[#6](\[#7])-[#7])-[#7]-[#6](=O)-[#6@H](-[#6]-c1ccc(-[#8])cc1)-[#7]-[#6]2=O)-[#6](=O)-[#7]-[#6@@H](-[#6]-[#6]-[#6]\[#7]=[#6](\[#7])-[#7])-[#6](-[#8])=O)-[#7]-[#6](=O)-[#6@@H](-[#7]-[#6](=O)-[#6@H](-[#6]-[#6]-[#6]\[#7]=[#6](\[#7])-[#7])-[#7]-[#6](=O)-[#6@@H](-[#7])-[#6]-[#6]-[#6]-[#7]-[#6](-[#7])=O)-c1ccc2ccccc2c1
Show InChI InChI=1S/C89H137N31O20S2/c90-35-5-3-17-57-73(126)113-62(18-4-6-36-91)82(135)120-43-13-24-68(120)80(133)116-65(45-50-27-33-55(122)34-28-50)77(130)112-58(19-8-37-102-84(93)94)72(125)110-60(22-11-42-107-89(101)140)74(127)117-66(78(131)114-63(83(136)137)23-12-39-104-86(97)98)47-141-142-48-67(79(132)115-64(44-49-25-31-54(121)32-26-49)76(129)111-59(71(124)109-57)21-10-41-106-88(100)139)118-81(134)69(53-30-29-51-14-1-2-15-52(51)46-53)119-75(128)61(20-9-38-103-85(95)96)108-70(123)56(92)16-7-40-105-87(99)138/h1-2,14-15,25-34,46,56-69,121-122H,3-13,16-24,35-45,47-48,90-92H2,(H,108,123)(H,109,124)(H,110,125)(H,111,129)(H,112,130)(H,113,126)(H,114,131)(H,115,132)(H,116,133)(H,117,127)(H,118,134)(H,119,128)(H,136,137)(H4,93,94,102)(H4,95,96,103)(H4,97,98,104)(H3,99,105,138)(H3,100,106,139)(H3,101,107,140)/t56-,57+,58-,59-,60-,61-,62-,63-,64+,65-,66+,67+,68+,69-/m0/s1
n/an/an/an/a 37n/an/an/an/a
Kyoto University
Curated by ChEMBL
Assay Description
Effective concentration for 50% protection of HIV-induced cytopathogenicity in MT-4 cells on the MTT assay
Bioorg Med Chem Lett 11: 1897-902 (2001)
BindingDB Entry DOI: 10.7270/Q25X29FS