null
SMILES: [O-][n+]1cc(ccc1S(=O)(=O)Cc1ccccc1)C(=O)Nc1ccc(F)cc1
InChI Key: InChIKey=XUNMHDBDUOUNHX-UHFFFAOYSA-N
Activity Spreadsheet -- Enzyme Inhibition Constant Data from BindingDB
Found 1 hit for monomerid = 50102226
Trg + Lig
Ki
nM
ΔG°
kcal/mole
IC50
nM
Kd
nM
EC50/IC50
nM
koff
s-1
kon
M-1s-1
pHTemp
°C
C-X-C chemokine receptor type 2
(Homo sapiens (Human))
BDBM50102226
(CHEMBL58619 | N-(4-Fluoro-phenyl)-1-oxy-6-phenylme...)
Show SMILES [O-][n+]1cc(ccc1S(=O)(=O)Cc1ccccc1)C(=O)Nc1ccc(F)cc1
Show InChI InChI=1S/C19H15FN2O4S/c20-16-7-9-17(10-8-16)21-19(23)15-6-11-18(22(24)12-15)27(25,26)13-14-4-2-1-3-5-14/h1-12H,13H2,(H,21,23)
Reactome pathway
n/an/a 280n/an/an/an/an/an/a
Celltech R&D
Curated by ChEMBL
Assay Description
Evaluated using an SPA assay with recombinant human [125I]-IL-8 and membranes preparedfrom Sf9 cells expressing human CXCR2
Bioorg Med Chem Lett 11: 1951-4 (2001)
BindingDB Entry DOI: 10.7270/Q2TX3DN0