BDBM50102526 CHEMBL405793::GFCDGFYACYMDV-OH
SMILES: CSCC[C@H](NC(=O)[C@H](Cc1ccc(O)cc1)NC(=O)[C@@H]1CSSC[C@H](NC(=O)[C@H](Cc2ccccc2)NC(=O)CN)C(=O)N[C@@H](CC(O)=O)C(=O)NCC(=O)N[C@@H](Cc2ccccc2)C(=O)N[C@@H](Cc2ccc(O)cc2)C(=O)N[C@@H](C)C(=O)N1)C(=O)N[C@@H](CC(O)=O)C(=O)N[C@@H](C(C)C)C(O)=O
InChI Key: InChIKey=FQHSWEMYTANHHK-ASGLUYHXSA-N
Data: 1 Kd
Activity Spreadsheet -- Enzyme Inhibition Constant Data from BindingDB
Found 1 hit for monomerid = 50102526
Trg + Lig
Ki
nM
ΔG°
kcal/mole
IC50
nM
Kd
nM
EC50/IC50
nM
koff
s-1
kon
M-1s-1
pHTemp
°C
Receptor tyrosine-protein kinase erbB-2
(Homo sapiens (Human))
BDBM50102526
(CHEMBL405793 | GFCDGFYACYMDV-OH)
Show SMILES CSCC[C@H](NC(=O)[C@H](Cc1ccc(O)cc1)NC(=O)[C@@H]1CSSC[C@H](NC(=O)[C@H](Cc2ccccc2)NC(=O)CN)C(=O)N[C@@H](CC(O)=O)C(=O)NCC(=O)N[C@@H](Cc2ccccc2)C(=O)N[C@@H](Cc2ccc(O)cc2)C(=O)N[C@@H](C)C(=O)N1)C(=O)N[C@@H](CC(O)=O)C(=O)N[C@@H](C(C)C)C(O)=O
Show InChI InChI=1S/C67H85N13O20S3/c1-35(2)56(67(99)100)80-64(96)49(30-55(87)88)77-59(91)43(23-24-101-4)73-63(95)47(28-40-17-21-42(82)22-18-40)75-65(97)50-33-102-103-34-51(79-62(94)44(71-52(83)31-68)25-37-11-7-5-8-12-37)66(98)76-48(29-54(85)86)58(90)69-32-53(84)72-45(26-38-13-9-6-10-14-38)61(93)74-46(27-39-15-19-41(81)20-16-39)60(92)70-36(3)57(89)78-50/h5-22,35-36,43-51,56,81-82H,23-34,68H2,1-4H3,(H,69,90)(H,70,92)(H,71,83)(H,72,84)(H,73,95)(H,74,93)(H,75,97)(H,76,98)(H,77,91)(H,78,89)(H,79,94)(H,80,96)(H,85,86)(H,87,88)(H,99,100)/t36-,43-,44-,45-,46-,47-,48-,49-,50-,51-,56-/m0/s1
n/an/an/a 730n/an/an/an/an/a
University of Pennsylvania School of Medicine
Curated by ChEMBL
Assay Description
Dissociation constant for peptide inhibtor binding to HER2 receptor
J Med Chem 44: 2565-74 (2001)
BindingDB Entry DOI: 10.7270/Q2P55MTN