BDBM50102647 CHEMBL3335685
SMILES: CC(C)CS(=O)(=O)N1CCC[C@@H](C1)NC(=O)Nc1cnc2[nH]ccc2n1
InChI Key:
Data: 3 IC50  1 EC50
PDB links: 1 PDB ID matches this monomer.
Activity Spreadsheet -- Enzyme Inhibition Constant Data from BindingDB
Found 4 hits for monomerid = 50102647
Trg + Lig
Ki
nM
ΔG°
kcal/mole
IC50
nM
Kd
nM
EC50/IC50
nM
koff
s-1
kon
M-1s-1
pHTemp
°C
Tyrosine-protein kinase JAK3
(Homo sapiens (Human))
BDBM50102647
(CHEMBL3335685)
Show SMILES CC(C)CS(=O)(=O)N1CCC[C@@H](C1)NC(=O)Nc1cnc2[nH]ccc2n1 |r|
Reactome pathway
n/an/a 7n/an/an/an/an/an/a
Hoffmann-La Roche Inc.
Curated by ChEMBL
Assay Description
Inhibition of JAK3 (unknown origin)-mediated phosphorylation of Biotin-KAIETDKEYYTVKD incubated for 10 mins prior to substrate addition measured afte...
Bioorg Med Chem Lett 24: 4969-75 (2014)
Article DOI: 10.1016/j.bmcl.2014.09.031
BindingDB Entry DOI: 10.7270/Q25X2BPB
3D
3D Structure (crystal)
Tyrosine-protein kinase JAK2
(Homo sapiens (Human))
BDBM50102647
(CHEMBL3335685)
Show SMILES CC(C)CS(=O)(=O)N1CCC[C@@H](C1)NC(=O)Nc1cnc2[nH]ccc2n1 |r|
Reactome pathway
n/an/an/an/a 452n/an/an/an/a
Hoffmann-La Roche Inc.
Curated by ChEMBL
Assay Description
Inhibition of JAK2 in human PBMC expressing CD14 assessed as inhibition of GM-CSF-stimulated STAT5a phosphorylation after 30 mins by flow cytometric ...
Bioorg Med Chem Lett 24: 4969-75 (2014)
Article DOI: 10.1016/j.bmcl.2014.09.031
BindingDB Entry DOI: 10.7270/Q25X2BPB
Tyrosine-protein kinase JAK1
(Homo sapiens (Human))
BDBM50102647
(CHEMBL3335685)
Show SMILES CC(C)CS(=O)(=O)N1CCC[C@@H](C1)NC(=O)Nc1cnc2[nH]ccc2n1 |r|
Reactome pathway
n/an/a 35n/an/an/an/an/an/a
Hoffmann-La Roche Inc.
Curated by ChEMBL
Assay Description
Inhibition of JAK1 (unknown origin)-mediated phosphorylation of Biotin-KAIETDKEYYTVKD incubated for 10 mins prior to substrate addition measured afte...
Bioorg Med Chem Lett 24: 4969-75 (2014)
Article DOI: 10.1016/j.bmcl.2014.09.031
BindingDB Entry DOI: 10.7270/Q25X2BPB
Tyrosine-protein kinase JAK2
(Homo sapiens (Human))
BDBM50102647
(CHEMBL3335685)
Show SMILES CC(C)CS(=O)(=O)N1CCC[C@@H](C1)NC(=O)Nc1cnc2[nH]ccc2n1 |r|
Reactome pathway
n/an/a 47n/an/an/an/an/an/a
Hoffmann-La Roche Inc.
Curated by ChEMBL
Assay Description
Inhibition of JAK2 (unknown origin)-mediated phosphorylation of Biotin-KAIETDKEYYTVKD incubated for 10 mins prior to substrate addition measured afte...
Bioorg Med Chem Lett 24: 4969-75 (2014)
Article DOI: 10.1016/j.bmcl.2014.09.031
BindingDB Entry DOI: 10.7270/Q25X2BPB