null
SMILES: COc1cccc(CNC(=O)c2nc3cccc(CCCc4ccccc4)c3c(=O)[nH]2)c1
InChI Key: InChIKey=VCRANPASSVNQBE-UHFFFAOYSA-N
Activity Spreadsheet -- Enzyme Inhibition Constant Data from BindingDB
Found 1 hit for monomerid = 50102763
Trg + Lig
Ki
nM
ΔG°
kcal/mole
IC50
nM
Kd
nM
EC50/IC50
nM
koff
s-1
kon
M-1s-1
pHTemp
°C
Collagenase 3
(Homo sapiens (Human))
BDBM50102763
(CHEMBL3359082)
Show SMILES COc1cccc(CNC(=O)c2nc3cccc(CCCc4ccccc4)c3c(=O)[nH]2)c1
Show InChI InChI=1S/C26H25N3O3/c1-32-21-14-6-11-19(16-21)17-27-26(31)24-28-22-15-7-13-20(23(22)25(30)29-24)12-5-10-18-8-3-2-4-9-18/h2-4,6-9,11,13-16H,5,10,12,17H2,1H3,(H,27,31)(H,28,29,30)
NCI pathway
Reactome pathway
n/an/a 2.90n/an/an/an/an/an/a
Takeda Pharmaceutical Company Limited
Curated by ChEMBL
Assay Description
Inhibition of human recombinant MMP13 using Cy3-PLGLK(Cy5Q)AR-NH2 as substrate after 40 mins by spectrofluorimetry
J Med Chem 57: 8886-902 (2014)
Article DOI: 10.1021/jm500981k
BindingDB Entry DOI: 10.7270/Q28P628P