BDBM50102800 CHEMBL3359073
SMILES: COc1cccc(CNC(=O)c2nc3cccc(C#N)c3c(=O)[nH]2)c1
InChI Key: InChIKey=FFZPLZVSLOXRLU-UHFFFAOYSA-N
Data: 1 IC50
Activity Spreadsheet -- Enzyme Inhibition Constant Data from BindingDB
Found 1 hit for monomerid = 50102800
Trg + Lig
Ki
nM
ΔG°
kcal/mole
IC50
nM
Kd
nM
EC50/IC50
nM
koff
s-1
kon
M-1s-1
pHTemp
°C
Collagenase 3
(Homo sapiens (Human))
BDBM50102800
(CHEMBL3359073)
Show SMILES COc1cccc(CNC(=O)c2nc3cccc(C#N)c3c(=O)[nH]2)c1
Show InChI InChI=1S/C18H14N4O3/c1-25-13-6-2-4-11(8-13)10-20-18(24)16-21-14-7-3-5-12(9-19)15(14)17(23)22-16/h2-8H,10H2,1H3,(H,20,24)(H,21,22,23)
NCI pathway
Reactome pathway
n/an/a 8.60n/an/an/an/an/an/a
Takeda Pharmaceutical Company Limited
Curated by ChEMBL
Assay Description
Inhibition of human recombinant MMP13 using Cy3-PLGLK(Cy5Q)AR-NH2 as substrate after 40 mins by spectrofluorimetry
J Med Chem 57: 8886-902 (2014)
Article DOI: 10.1021/jm500981k
BindingDB Entry DOI: 10.7270/Q28P628P