BDBM50103305 1-{3-[4-(2-Isopropyl-phenylsulfanyl)-3-nitro-phenyl]-acryloyl}-piperidine-3-carboxylic acid::CHEMBL99066
SMILES: CC(C)c1ccccc1Sc1ccc(\C=C\C(=O)N2CCCC(C2)C(O)=O)cc1[N+]([O-])=O
InChI Key: InChIKey=MRWGXKWDMVKCMX-ZRDIBKRKSA-N
Data: 1 IC50
Activity Spreadsheet -- Enzyme Inhibition Constant Data from BindingDB
Found 1 hit for monomerid = 50103305
Trg + Lig
Ki
nM
ΔG°
kcal/mole
IC50
nM
Kd
nM
EC50/IC50
nM
koff
s-1
kon
M-1s-1
pHTemp
°C
Integrin beta-2/Intercellular adhesion molecule-1 /Leukocyte adhesion glycoprotein LFA-1 alpha
(Homo sapiens (Human))
BDBM50103305
(1-{3-[4-(2-Isopropyl-phenylsulfanyl)-3-nitro-pheny...)
Show SMILES CC(C)c1ccccc1Sc1ccc(\C=C\C(=O)N2CCCC(C2)C(O)=O)cc1[N+]([O-])=O
Show InChI InChI=1S/C24H26N2O5S/c1-16(2)19-7-3-4-8-21(19)32-22-11-9-17(14-20(22)26(30)31)10-12-23(27)25-13-5-6-18(15-25)24(28)29/h3-4,7-12,14,16,18H,5-6,13,15H2,1-2H3,(H,28,29)/b12-10+
n/an/a 30n/an/an/an/an/an/a
Abbott Laboratories
Curated by ChEMBL
Assay Description
Ability to antagonise the Leukocyte function-associated Antigen-1/ Intracellular Adhesion molecule-1 interaction (LFA-1/ICAM-1)
J Med Chem 44: 2913-20 (2001)
BindingDB Entry DOI: 10.7270/Q2PZ5831