BDBM50103331 4-(5-{[1-(Naphthalene-1-carbonyl)-pyrrolidin-3-ylamino]-methyl}-imidazol-1-ylmethyl)-benzonitrile::CHEMBL327278
SMILES: O=C(N1CC[C@@H](C1)NCc1cncn1Cc1ccc(cc1)C#N)c1cccc2ccccc12
InChI Key: InChIKey=DIDRALNGAJEZDV-QHCPKHFHSA-N
Data: 3 IC50
Activity Spreadsheet -- Enzyme Inhibition Constant Data from BindingDB
Found 3 hits for monomerid = 50103331
Trg + Lig
Ki
nM
ΔG°
kcal/mole
IC50
nM
Kd
nM
EC50/IC50
nM
koff
s-1
kon
M-1s-1
pHTemp
°C
Protein Farnesyltransferase (PFT) Chain B
(Homo sapiens (Human))
BDBM50103331
(4-(5-{[1-(Naphthalene-1-carbonyl)-pyrrolidin-3-yla...)
Show SMILES O=C(N1CC[C@@H](C1)NCc1cncn1Cc1ccc(cc1)C#N)c1cccc2ccccc12
Show InChI InChI=1S/C27H25N5O/c28-14-20-8-10-21(11-9-20)17-32-19-29-15-24(32)16-30-23-12-13-31(18-23)27(33)26-7-3-5-22-4-1-2-6-25(22)26/h1-11,15,19,23,30H,12-13,16-18H2/t23-/m0/s1
n/an/a 330n/an/an/an/an/an/a
Merck Research Laboratories
Curated by ChEMBL
Assay Description
Concentration required to displace 50% of a potent radiolabeled FTI from farnesyl transferase in cultured H-ras-transformed Rat1 cells
J Med Chem 44: 2933-49 (2001)
BindingDB Entry DOI: 10.7270/Q2FF3RNW
Protein Farnesyltransferase (PFT) Chain B
(Homo sapiens (Human))
BDBM50103331
(4-(5-{[1-(Naphthalene-1-carbonyl)-pyrrolidin-3-yla...)
Show SMILES O=C(N1CC[C@@H](C1)NCc1cncn1Cc1ccc(cc1)C#N)c1cccc2ccccc12
Show InChI InChI=1S/C27H25N5O/c28-14-20-8-10-21(11-9-20)17-32-19-29-15-24(32)16-30-23-12-13-31(18-23)27(33)26-7-3-5-22-4-1-2-6-25(22)26/h1-11,15,19,23,30H,12-13,16-18H2/t23-/m0/s1
n/an/a 11n/an/an/an/an/an/a
Merck Research Laboratories
Curated by ChEMBL
Assay Description
In vitro inhibition of farnesyl transferase using purified recombinant human enzyme
J Med Chem 44: 2933-49 (2001)
BindingDB Entry DOI: 10.7270/Q2FF3RNW
Geranylgeranyl transferase type I
(Homo sapiens (Human))
BDBM50103331
(4-(5-{[1-(Naphthalene-1-carbonyl)-pyrrolidin-3-yla...)
Show SMILES O=C(N1CC[C@@H](C1)NCc1cncn1Cc1ccc(cc1)C#N)c1cccc2ccccc12
Show InChI InChI=1S/C27H25N5O/c28-14-20-8-10-21(11-9-20)17-32-19-29-15-24(32)16-30-23-12-13-31(18-23)27(33)26-7-3-5-22-4-1-2-6-25(22)26/h1-11,15,19,23,30H,12-13,16-18H2/t23-/m0/s1
Reactome pathway
n/an/a 880n/an/an/an/an/an/a
Merck Research Laboratories
Curated by ChEMBL
Assay Description
Inhibitory concentration of geranylgeranyl-protein transferase type I
J Med Chem 44: 2933-49 (2001)
BindingDB Entry DOI: 10.7270/Q2FF3RNW