BDBM50103341 4-{5-[2-(2-Oxo-1-phenethyl-pyrrolidin-3-ylamino)-ethyl]-imidazol-1-ylmethyl}-benzonitrile::CHEMBL317747
SMILES: O=C1[C@@H](CCN1CCc1ccccc1)NCCc1cncn1Cc1ccc(cc1)C#N
InChI Key: InChIKey=ZFIIDVFVNVOHRN-XMMPIXPASA-N
Data: 2 IC50
Activity Spreadsheet -- Enzyme Inhibition Constant Data from BindingDB
Found 2 hits for monomerid = 50103341
Trg + Lig
Ki
nM
ΔG°
kcal/mole
IC50
nM
Kd
nM
EC50/IC50
nM
koff
s-1
kon
M-1s-1
pHTemp
°C
Geranylgeranyl transferase type I
(Homo sapiens (Human))
BDBM50103341
(4-{5-[2-(2-Oxo-1-phenethyl-pyrrolidin-3-ylamino)-e...)
Show SMILES O=C1[C@@H](CCN1CCc1ccccc1)NCCc1cncn1Cc1ccc(cc1)C#N
Show InChI InChI=1S/C25H27N5O/c26-16-21-6-8-22(9-7-21)18-30-19-27-17-23(30)10-13-28-24-12-15-29(25(24)31)14-11-20-4-2-1-3-5-20/h1-9,17,19,24,28H,10-15,18H2/t24-/m1/s1
Reactome pathway
n/an/a 1.50E+3n/an/an/an/an/an/a
Merck Research Laboratories
Curated by ChEMBL
Assay Description
Inhibitory concentration of geranylgeranyl-protein transferase type I
J Med Chem 44: 2933-49 (2001)
BindingDB Entry DOI: 10.7270/Q2FF3RNW
Protein Farnesyltransferase (PFT) Chain B
(Homo sapiens (Human))
BDBM50103341
(4-{5-[2-(2-Oxo-1-phenethyl-pyrrolidin-3-ylamino)-e...)
Show SMILES O=C1[C@@H](CCN1CCc1ccccc1)NCCc1cncn1Cc1ccc(cc1)C#N
Show InChI InChI=1S/C25H27N5O/c26-16-21-6-8-22(9-7-21)18-30-19-27-17-23(30)10-13-28-24-12-15-29(25(24)31)14-11-20-4-2-1-3-5-20/h1-9,17,19,24,28H,10-15,18H2/t24-/m1/s1
n/an/a 380n/an/an/an/an/an/a
Merck Research Laboratories
Curated by ChEMBL
Assay Description
In vitro inhibition of farnesyl transferase using purified recombinant human enzyme
J Med Chem 44: 2933-49 (2001)
BindingDB Entry DOI: 10.7270/Q2FF3RNW