null
SMILES: CC1CN2C(C(C)O1)C1(Cc3cc4c(C)noc4c(F)c23)C(=O)NC(=O)NC1=O
InChI Key: InChIKey=FWKBFPFKHVTISW-UHFFFAOYSA-N
Activity Spreadsheet -- Enzyme Inhibition Constant Data from BindingDB
Found 1 hit for monomerid = 50103538
Trg + Lig
Ki
nM
ΔG°
kcal/mole
IC50
nM
Kd
nM
EC50/IC50
nM
koff
s-1
kon
M-1s-1
pHTemp
°C
DNA gyrase subunit A/B
(Escherichia coli (strain K12))
BDBM50103538
(CHEMBL3357561)
Show SMILES CC1CN2C(C(C)O1)C1(Cc3cc4c(C)noc4c(F)c23)C(=O)NC(=O)NC1=O
Show InChI InChI=1S/C19H19FN4O5/c1-7-6-24-13-10(4-11-8(2)23-29-14(11)12(13)20)5-19(15(24)9(3)28-7)16(25)21-18(27)22-17(19)26/h4,7,9,15H,5-6H2,1-3H3,(H2,21,22,25,26,27)
n/an/a 0.380n/an/an/an/an/an/a
AstraZeneca
Curated by ChEMBL
Assay Description
Inhibition of Escherichia coli DNA gyrase using fluorescence-tagged DNA by fluorescenct polarization assay
J Med Chem 57: 9078-95 (2014)
BindingDB Entry DOI: 10.7270/Q2F76FB6