BDBM50103567 CHEMBL3335792
SMILES: Clc1ccccc1SC1C(=O)CC(NC1=O)(c1ccsc1)c1ccc(cc1)N1CCOCC1
InChI Key: InChIKey=GLDDJXYFHWRGPI-UHFFFAOYSA-N
Data: 1 IC50
Activity Spreadsheet -- Enzyme Inhibition Constant Data from BindingDB
Found 1 hit for monomerid = 50103567
Trg + Lig
Ki
nM
ΔG°
kcal/mole
IC50
nM
Kd
nM
EC50/IC50
nM
koff
s-1
kon
M-1s-1
pHTemp
°C
Lactate dehydrogenase A (LDHA)
(Homo sapiens (Human))
BDBM50103567
(CHEMBL3335792)
Show SMILES Clc1ccccc1SC1C(=O)CC(NC1=O)(c1ccsc1)c1ccc(cc1)N1CCOCC1
Show InChI InChI=1S/C25H23ClN2O3S2/c26-20-3-1-2-4-22(20)33-23-21(29)15-25(27-24(23)30,18-9-14-32-16-18)17-5-7-19(8-6-17)28-10-12-31-13-11-28/h1-9,14,16,23H,10-13,15H2,(H,27,30)
Reactome pathway
n/an/a 5n/an/an/an/an/an/a
Universit£ di Pisa
Curated by ChEMBL
Assay Description
Inhibition of LDHA (unknown origin)
Bioorg Med Chem Lett 24: 4915-25 (2014)
BindingDB Entry DOI: 10.7270/Q25Q4XV9