BDBM50103573 CHEMBL3337583
SMILES: COc1ccc(cc1N(C)C)C(=O)N1CCC2(CC1)Nc1cc(OC(F)(F)F)ccc1-n1cccc21
InChI Key: InChIKey=NISDATURCATRJI-UHFFFAOYSA-N
Data: 2 IC50
Activity Spreadsheet -- Enzyme Inhibition Constant Data from BindingDB
Found 2 hits for monomerid = 50103573
Trg + Lig
Ki
nM
ΔG°
kcal/mole
IC50
nM
Kd
nM
EC50/IC50
nM
koff
s-1
kon
M-1s-1
pHTemp
°C
Sodium channel protein type 5 subunit alpha
(Homo sapiens (Human))
BDBM50103573
(CHEMBL3337583)
Show SMILES COc1ccc(cc1N(C)C)C(=O)N1CCC2(CC1)Nc1cc(OC(F)(F)F)ccc1-n1cccc21
Show InChI InChI=1S/C26H27F3N4O3/c1-31(2)21-15-17(6-9-22(21)35-3)24(34)32-13-10-25(11-14-32)23-5-4-12-33(23)20-8-7-18(16-19(20)30-25)36-26(27,28)29/h4-9,12,15-16,30H,10-11,13-14H2,1-3H3
n/an/a 181n/an/an/an/an/an/a
Merck Research Laboratory
Curated by ChEMBL
Assay Description
Inhibition of human Nav1.5 expressed in HEK293 cells after 60 mins by FLIPR assay
Bioorg Med Chem Lett 24: 4958-62 (2014)
BindingDB Entry DOI: 10.7270/Q21Z465T
Sodium channel protein type 9 subunit alpha
(Homo sapiens (Human))
BDBM50103573
(CHEMBL3337583)
Show SMILES COc1ccc(cc1N(C)C)C(=O)N1CCC2(CC1)Nc1cc(OC(F)(F)F)ccc1-n1cccc21
Show InChI InChI=1S/C26H27F3N4O3/c1-31(2)21-15-17(6-9-22(21)35-3)24(34)32-13-10-25(11-14-32)23-5-4-12-33(23)20-8-7-18(16-19(20)30-25)36-26(27,28)29/h4-9,12,15-16,30H,10-11,13-14H2,1-3H3
n/an/a 19n/an/an/an/an/an/a
Merck Research Laboratory
Curated by ChEMBL
Assay Description
Inhibition of human Nav1.7 expressed in HEK293 cells after 60 mins by FLIPR assay
Bioorg Med Chem Lett 24: 4958-62 (2014)
BindingDB Entry DOI: 10.7270/Q21Z465T