BDBM50103587 CHEMBL3337597
SMILES: COc1ccc-2c(NC3(CCN(CC3)C(=O)c3ccc4ncccc4c3)c3cccn-23)c1
InChI Key: InChIKey=JBTGSFIEOSACRJ-UHFFFAOYSA-N
Data: 3 IC50
Activity Spreadsheet -- Enzyme Inhibition Constant Data from BindingDB
Found 3 hits for monomerid = 50103587
Trg + Lig
Ki
nM
ΔG°
kcal/mole
IC50
nM
Kd
nM
EC50/IC50
nM
koff
s-1
kon
M-1s-1
pHTemp
°C
Sodium channel protein type 9 subunit alpha
(Homo sapiens (Human))
BDBM50103587
(CHEMBL3337597)
Show SMILES COc1ccc-2c(NC3(CCN(CC3)C(=O)c3ccc4ncccc4c3)c3cccn-23)c1
Show InChI InChI=1S/C26H24N4O2/c1-32-20-7-9-23-22(17-20)28-26(24-5-3-13-30(23)24)10-14-29(15-11-26)25(31)19-6-8-21-18(16-19)4-2-12-27-21/h2-9,12-13,16-17,28H,10-11,14-15H2,1H3
n/an/a 64n/an/an/an/an/an/a
Merck Research Laboratory
Curated by ChEMBL
Assay Description
Inhibition of human Nav1.7 expressed in HEK293 cells after 60 mins by FLIPR assay
Bioorg Med Chem Lett 24: 4958-62 (2014)
BindingDB Entry DOI: 10.7270/Q21Z465T
Sodium channel protein type 9 subunit alpha
(Homo sapiens (Human))
BDBM50103587
(CHEMBL3337597)
Show SMILES COc1ccc-2c(NC3(CCN(CC3)C(=O)c3ccc4ncccc4c3)c3cccn-23)c1
Show InChI InChI=1S/C26H24N4O2/c1-32-20-7-9-23-22(17-20)28-26(24-5-3-13-30(23)24)10-14-29(15-11-26)25(31)19-6-8-21-18(16-19)4-2-12-27-21/h2-9,12-13,16-17,28H,10-11,14-15H2,1H3
n/an/a 690n/an/an/an/an/an/a
Merck Research Laboratory
Curated by ChEMBL
Assay Description
Inhibition of human Nav1.7 expressed in HEK293 cells by voltage clamp assay
Bioorg Med Chem Lett 24: 4958-62 (2014)
BindingDB Entry DOI: 10.7270/Q21Z465T
Sodium channel protein type 5 subunit alpha
(Homo sapiens (Human))
BDBM50103587
(CHEMBL3337597)
Show SMILES COc1ccc-2c(NC3(CCN(CC3)C(=O)c3ccc4ncccc4c3)c3cccn-23)c1
Show InChI InChI=1S/C26H24N4O2/c1-32-20-7-9-23-22(17-20)28-26(24-5-3-13-30(23)24)10-14-29(15-11-26)25(31)19-6-8-21-18(16-19)4-2-12-27-21/h2-9,12-13,16-17,28H,10-11,14-15H2,1H3
n/an/a 1.03E+3n/an/an/an/an/an/a
Merck Research Laboratory
Curated by ChEMBL
Assay Description
Inhibition of human Nav1.5 expressed in HEK293 cells after 60 mins by FLIPR assay
Bioorg Med Chem Lett 24: 4958-62 (2014)
BindingDB Entry DOI: 10.7270/Q21Z465T