BDBM50103600 ANTIPYRINE::Antipyrin::Antipyrine::CHEBI:31225::Phenazon::Phenazone
SMILES: Cc1cc(=O)n(-c2ccccc2)n1C
InChI Key: InChIKey=VEQOALNAAJBPNY-UHFFFAOYSA-N
Data: 7 IC50
Activity Spreadsheet -- Enzyme Inhibition Constant Data from BindingDB
Found 7 hits for monomerid = 50103600
Trg + Lig
Ki
nM
ΔG°
kcal/mole
IC50
nM
Kd
nM
EC50/IC50
nM
koff
s-1
kon
M-1s-1
pHTemp
°C
Cytochrome P450 2J2
(Homo sapiens (Human))
BDBM50103600
(ANTIPYRINE | Antipyrin | Antipyrine | CHEBI:31225 ...)
Show SMILES Cc1cc(=O)n(-c2ccccc2)n1C
Show InChI InChI=1S/C11H12N2O/c1-9-8-11(14)13(12(9)2)10-6-4-3-5-7-10/h3-8H,1-2H3
n/an/a>5.00E+4n/an/an/an/an/an/a
Tongji University
Curated by ChEMBL
Assay Description
Inhibition of human recombinant CYP2J2 assessed as reduction in astemizole O-demethylation by LC-MS/MS method
Drug Metab Dispos 41: 60-71 (2012)
Article DOI: 10.1124/dmd.112.048264
BindingDB Entry DOI: 10.7270/Q2K0761G
Bile salt export pump
(Homo sapiens (Human))
BDBM50103600
(ANTIPYRINE | Antipyrin | Antipyrine | CHEBI:31225 ...)
Show SMILES Cc1cc(=O)n(-c2ccccc2)n1C
Show InChI InChI=1S/C11H12N2O/c1-9-8-11(14)13(12(9)2)10-6-4-3-5-7-10/h3-8H,1-2H3
n/an/a>1.35E+5n/an/an/an/an/an/a
Amgen Inc.
Curated by ChEMBL
Assay Description
Inhibition of human BSEP expressed in fall armyworm sf9 cell plasma membrane vesicles assessed as reduction in vesicle-associated [3H]-taurocholate t...
Toxicol Sci 118: 485-500 (2010)
Article DOI: 10.1093/toxsci/kfq269
BindingDB Entry DOI: 10.7270/Q26Q20JN
Bile salt export pump
(Homo sapiens (Human))
BDBM50103600
(ANTIPYRINE | Antipyrin | Antipyrine | CHEBI:31225 ...)
Show SMILES Cc1cc(=O)n(-c2ccccc2)n1C
Show InChI InChI=1S/C11H12N2O/c1-9-8-11(14)13(12(9)2)10-6-4-3-5-7-10/h3-8H,1-2H3
n/an/a>1.00E+6n/an/an/an/an/an/a
AstraZeneca
Curated by ChEMBL
Assay Description
Inhibition of human BSEP expressed in baculovirus transfected fall armyworm Sf21 cell membranes vesicles assessed as reduction in ATP-dependent [3H]-...
Drug Metab Dispos 40: 2332-41 (2012)
Article DOI: 10.1124/dmd.112.047068
BindingDB Entry DOI: 10.7270/Q2ZP488M
Multidrug resistance-associated protein 4
(Homo sapiens (Human))
BDBM50103600
(ANTIPYRINE | Antipyrin | Antipyrine | CHEBI:31225 ...)
Show SMILES Cc1cc(=O)n(-c2ccccc2)n1C
Show InChI InChI=1S/C11H12N2O/c1-9-8-11(14)13(12(9)2)10-6-4-3-5-7-10/h3-8H,1-2H3
Reactome pathway
n/an/a 1.33E+5n/an/an/an/an/an/a
Amgen Inc
Curated by ChEMBL
Assay Description
Inhibition of human MRP4 overexpressed in Sf9 cell membrane vesicles assessed as uptake of [3H]-estradiol-17beta-D-glucuronide in presence of ATP and...
Toxicol Sci 136: 216-41 (2013)
BindingDB Entry DOI: 10.7270/Q2JM2D2D
Canalicular multispecific organic anion transporter 1
(Homo sapiens (Human))
BDBM50103600
(ANTIPYRINE | Antipyrin | Antipyrine | CHEBI:31225 ...)
Show SMILES Cc1cc(=O)n(-c2ccccc2)n1C
Show InChI InChI=1S/C11H12N2O/c1-9-8-11(14)13(12(9)2)10-6-4-3-5-7-10/h3-8H,1-2H3
n/an/a 1.33E+5n/an/an/an/an/an/a
Amgen Inc
Curated by ChEMBL
Assay Description
Inhibition of human MRP2 overexpressed in Sf9 cell membrane vesicles assessed as uptake of [3H]-estradiol-17beta-D-glucuronide in presence of ATP and...
Toxicol Sci 136: 216-41 (2013)
BindingDB Entry DOI: 10.7270/Q2JM2D2D
Canalicular multispecific organic anion transporter 2
(Homo sapiens (Human))
BDBM50103600
(ANTIPYRINE | Antipyrin | Antipyrine | CHEBI:31225 ...)
Show SMILES Cc1cc(=O)n(-c2ccccc2)n1C
Show InChI InChI=1S/C11H12N2O/c1-9-8-11(14)13(12(9)2)10-6-4-3-5-7-10/h3-8H,1-2H3
Reactome pathway
n/an/a 1.33E+5n/an/an/an/an/an/a
Amgen Inc
Curated by ChEMBL
Assay Description
Inhibition of human MRP3 overexpressed in Sf9 insect cell membrane vesicles assessed as uptake of [3H]-estradiol-17beta-D-glucuronide in presence of ...
Toxicol Sci 136: 216-41 (2013)
BindingDB Entry DOI: 10.7270/Q2JM2D2D
Bile salt export pump
(Homo sapiens (Human))
BDBM50103600
(ANTIPYRINE | Antipyrin | Antipyrine | CHEBI:31225 ...)
Show SMILES Cc1cc(=O)n(-c2ccccc2)n1C
Show InChI InChI=1S/C11H12N2O/c1-9-8-11(14)13(12(9)2)10-6-4-3-5-7-10/h3-8H,1-2H3
n/an/a 1.33E+5n/an/an/an/an/an/a
Amgen Inc
Curated by ChEMBL
Assay Description
Inhibition of human BSEP overexpressed in Sf9 cell membrane vesicles assessed as uptake of [3H]-taurocholate in presence of ATP measured after 15 to ...
Toxicol Sci 136: 216-41 (2013)
BindingDB Entry DOI: 10.7270/Q2JM2D2D