BDBM50103611 CHEBI:31524::DOPS::DROXIDOPA::Droxidopa::L-DOPS
SMILES: N[C@@H]([C@H](O)c1ccc(O)c(O)c1)C(O)=O
InChI Key: InChIKey=QXWYKJLNLSIPIN-JGVFFNPUSA-N
Data: 3 EC50
Activity Spreadsheet -- Enzyme Inhibition Constant Data from BindingDB
Found 3 hits for monomerid = 50103611
Trg + Lig
Ki
nM
ΔG°
kcal/mole
IC50
nM
Kd
nM
EC50/IC50
nM
koff
s-1
kon
M-1s-1
pHTemp
°C
Nuclear receptor subfamily 1 group I member 2
(Rattus norvegicus)
BDBM50103611
(CHEBI:31524 | DOPS | DROXIDOPA | Droxidopa | L-DOP...)
Show SMILES N[C@@H]([C@H](O)c1ccc(O)c(O)c1)C(O)=O |r|
Show InChI InChI=1S/C9H11NO5/c10-7(9(14)15)8(13)4-1-2-5(11)6(12)3-4/h1-3,7-8,11-13H,10H2,(H,14,15)/t7-,8+/m0/s1
n/an/an/an/a 6.31E+4n/an/an/an/a
National Institutes of Health Chemical Genomics Center
Curated by ChEMBL
Assay Description
Competitive binding affinity to human PXR LBD (111 to 434) by TR-FRET assay
Drug Metab Dispos 39: 151-9 (2010)
Article DOI: 10.1124/dmd.110.035105
BindingDB Entry DOI: 10.7270/Q2JS9S5P
Pregnane X receptor
(Homo sapiens (Human))
BDBM50103611
(CHEBI:31524 | DOPS | DROXIDOPA | Droxidopa | L-DOP...)
Show SMILES N[C@@H]([C@H](O)c1ccc(O)c(O)c1)C(O)=O |r|
Show InChI InChI=1S/C9H11NO5/c10-7(9(14)15)8(13)4-1-2-5(11)6(12)3-4/h1-3,7-8,11-13H,10H2,(H,14,15)/t7-,8+/m0/s1
n/an/an/an/a 3.20E+3n/an/an/an/a
National Institutes of Health Chemical Genomics Center
Curated by ChEMBL
Assay Description
Competitive binding affinity to human PXR LBD (111 to 434) by TR-FRET assay
Drug Metab Dispos 39: 151-9 (2010)
Article DOI: 10.1124/dmd.110.035105
BindingDB Entry DOI: 10.7270/Q2JS9S5P
Pregnane X receptor
(Homo sapiens (Human))
BDBM50103611
(CHEBI:31524 | DOPS | DROXIDOPA | Droxidopa | L-DOP...)
Show SMILES N[C@@H]([C@H](O)c1ccc(O)c(O)c1)C(O)=O |r|
Show InChI InChI=1S/C9H11NO5/c10-7(9(14)15)8(13)4-1-2-5(11)6(12)3-4/h1-3,7-8,11-13H,10H2,(H,14,15)/t7-,8+/m0/s1
n/an/an/an/a 4n/an/an/an/a
National Institutes of Health Chemical Genomics Center
Curated by ChEMBL
Assay Description
Activation of human PXR expressed in human HepG2 (DPX-2) cells assessed as induction of CYP3A4 after 24 hrs by luminescent analysis
Drug Metab Dispos 39: 151-9 (2010)
Article DOI: 10.1124/dmd.110.035105
BindingDB Entry DOI: 10.7270/Q2JS9S5P