BDBM50103615 CHEBI:34789::HETACILLIN POTASSIUM::Hetacillin Potassium::Versapen-K
SMILES: [K+].[H][C@]12SC(C)(C)[C@@H](N1C(=O)[C@H]2N1C(=O)[C@H](NC1(C)C)c1ccccc1)C([O-])=O
InChI Key: InChIKey=DXVUYOAEDJXBPY-NFFDBFGFSA-M
Data: 1 EC50
Activity Spreadsheet -- Enzyme Inhibition Constant Data from BindingDB
Found 1 hit for monomerid = 50103615
Trg + Lig
Ki
nM
ΔG°
kcal/mole
IC50
nM
Kd
nM
EC50/IC50
nM
koff
s-1
kon
M-1s-1
pHTemp
°C
Pregnane X receptor
(Homo sapiens (Human))
BDBM50103615
(CHEBI:34789 | HETACILLIN POTASSIUM | Hetacillin Po...)
Show SMILES [K+].[H][C@]12SC(C)(C)[C@@H](N1C(=O)[C@H]2N1C(=O)[C@H](NC1(C)C)c1ccccc1)C([O-])=O |r|
Show InChI InChI=1S/C19H23N3O4S/c1-18(2)13(17(25)26)21-15(24)12(16(21)27-18)22-14(23)11(20-19(22,3)4)10-8-6-5-7-9-10/h5-9,11-13,16,20H,1-4H3,(H,25,26)/p-1/t11-,12-,13+,16-/m1/s1
n/an/an/an/a 6.30E+3n/an/an/an/a
National Institutes of Health Chemical Genomics Center
Curated by ChEMBL
Assay Description
Competitive binding affinity to human PXR LBD (111 to 434) by TR-FRET assay
Drug Metab Dispos 39: 151-9 (2010)
Article DOI: 10.1124/dmd.110.035105
BindingDB Entry DOI: 10.7270/Q2JS9S5P