BDBM50104200 CHEMBL7443
SMILES: O=C1NC(Nc2ncccc12)c1ccccc1
InChI Key: InChIKey=KSVCXYZWRHMFEQ-UHFFFAOYSA-N
Data: 2 IC50
Activity Spreadsheet -- Enzyme Inhibition Constant Data from BindingDB
Found 2 hits for monomerid = 50104200
Trg + Lig
Ki
nM
ΔG°
kcal/mole
IC50
nM
Kd
nM
EC50/IC50
nM
koff
s-1
kon
M-1s-1
pHTemp
°C
Poly [ADP-ribose] polymerase tankyrase-2
(Homo sapiens (Human))
BDBM50104200
(CHEMBL7443)
Show SMILES O=C1NC(Nc2ncccc12)c1ccccc1
Show InChI InChI=1S/C13H11N3O/c17-13-10-7-4-8-14-12(10)15-11(16-13)9-5-2-1-3-6-9/h1-8,11H,(H,14,15)(H,16,17)
n/an/a 1.15E+4n/an/an/an/an/an/a
University of Oulu
Curated by ChEMBL
Assay Description
Inhibition of human TNKS2 (956 to 1161 and 873 to 1161) using 500 nM NAD substrate after 20 mins incubation by fluorescence assay
Bioorg Med Chem 23: 4139-49 (2015)
Article DOI: 10.1016/j.bmc.2015.06.063
BindingDB Entry DOI: 10.7270/Q2W66NJ2
Poly [ADP-ribose] polymerase tankyrase-2
(Homo sapiens (Human))
BDBM50104200
(CHEMBL7443)
Show SMILES O=C1NC(Nc2ncccc12)c1ccccc1
Show InChI InChI=1S/C13H11N3O/c17-13-10-7-4-8-14-12(10)15-11(16-13)9-5-2-1-3-6-9/h1-8,11H,(H,14,15)(H,16,17)
n/an/a 1.20E+4n/an/an/an/an/an/a
University of Oulu
Curated by ChEMBL
Assay Description
Inhibition of human TNKS2 (956 to 1161 and 873 to 1161) using 500 nM NAD substrate after 20 mins incubation by fluorescence assay
Bioorg Med Chem 23: 4139-49 (2015)
Article DOI: 10.1016/j.bmc.2015.06.063
BindingDB Entry DOI: 10.7270/Q2W66NJ2