BDBM50104549 5-(2-{(S)-2-[5-[2-(2-Aza-bicyclo[2.2.2]oct-2-yl)-1,1-dimethyl-2-oxo-ethyl]-2-(3,5-dimethyl-phenyl)-1H-indol-3-yl]-propylamino}-ethyl)-1-methoxymethyl-1H-pyridin-2-one::CHEMBL312864
SMILES: COCn1cc(CCNC[C@@H](C)c2c([nH]c3ccc(cc23)C(C)(C)C(=O)N2CC3CCC2CC3)-c2cc(C)cc(C)c2)ccc1=O
InChI Key: InChIKey=WEXGSFGAVGLVMG-NGFHQYDQSA-N
Data: 2 IC50
Activity Spreadsheet -- Enzyme Inhibition Constant Data from BindingDB
Found 2 hits for monomerid = 50104549
Trg + Lig
Ki
nM
ΔG°
kcal/mole
IC50
nM
Kd
nM
EC50/IC50
nM
koff
s-1
kon
M-1s-1
pHTemp
°C
Gonadotropin-releasing hormone receptor
(Homo sapiens (Human))
BDBM50104549
(5-(2-{(S)-2-[5-[2-(2-Aza-bicyclo[2.2.2]oct-2-yl)-1...)
Show SMILES COCn1cc(CCNC[C@@H](C)c2c([nH]c3ccc(cc23)C(C)(C)C(=O)N2CC3CCC2CC3)-c2cc(C)cc(C)c2)ccc1=O |wD:10.10,TLB:24:26:30.29:32.33,(18.23,-1.38,;17.46,-.05,;15.92,-.03,;15.17,1.3,;13.63,1.31,;12.86,2.65,;11.32,2.65,;10.55,1.32,;9.01,1.33,;8.24,,;6.7,.02,;5.93,1.35,;5.91,-1.31,;6.53,-2.73,;5.39,-3.74,;4.06,-2.97,;2.6,-3.44,;1.47,-2.41,;1.8,-.91,;3.25,-.44,;4.39,-1.48,;.66,.13,;-.44,1.23,;2.15,.54,;-.81,-.33,;-1.14,-1.84,;-2.05,.6,;-1.65,1.93,;-2.82,2.33,;-4.43,1.7,;-5.08,.2,;-3.63,.82,;-3.63,2.98,;-2.82,4.08,;8.03,-3.06,;8.5,-4.53,;10.01,-4.85,;10.48,-6.31,;11.04,-3.71,;10.57,-2.24,;11.6,-1.1,;9.06,-1.91,;13.63,3.98,;15.17,3.98,;15.94,2.63,;17.48,2.63,)|
Show InChI InChI=1S/C39H50N4O3/c1-25-17-26(2)19-30(18-25)37-36(27(3)21-40-16-15-29-9-14-35(44)42(22-29)24-46-6)33-20-31(10-13-34(33)41-37)39(4,5)38(45)43-23-28-7-11-32(43)12-8-28/h9-10,13-14,17-20,22,27-28,32,40-41H,7-8,11-12,15-16,21,23-24H2,1-6H3/t27-,28?,32?/m1/s1
n/an/a 0.400n/an/an/an/an/an/a
Merck Research Laboratories
Curated by ChEMBL
Assay Description
Binding inhibition towards human pituitary gonadotropin-releasing hormone receptor using [125I]-buserelin.
Bioorg Med Chem Lett 11: 2597-602 (2001)
BindingDB Entry DOI: 10.7270/Q2NV9HKC
Gonadotropin releasing hormone 1 (GnRHR1)
(Homo sapiens (Human))
BDBM50104549
(5-(2-{(S)-2-[5-[2-(2-Aza-bicyclo[2.2.2]oct-2-yl)-1...)
Show SMILES COCn1cc(CCNC[C@@H](C)c2c([nH]c3ccc(cc23)C(C)(C)C(=O)N2CC3CCC2CC3)-c2cc(C)cc(C)c2)ccc1=O |wD:10.10,TLB:24:26:30.29:32.33,(18.23,-1.38,;17.46,-.05,;15.92,-.03,;15.17,1.3,;13.63,1.31,;12.86,2.65,;11.32,2.65,;10.55,1.32,;9.01,1.33,;8.24,,;6.7,.02,;5.93,1.35,;5.91,-1.31,;6.53,-2.73,;5.39,-3.74,;4.06,-2.97,;2.6,-3.44,;1.47,-2.41,;1.8,-.91,;3.25,-.44,;4.39,-1.48,;.66,.13,;-.44,1.23,;2.15,.54,;-.81,-.33,;-1.14,-1.84,;-2.05,.6,;-1.65,1.93,;-2.82,2.33,;-4.43,1.7,;-5.08,.2,;-3.63,.82,;-3.63,2.98,;-2.82,4.08,;8.03,-3.06,;8.5,-4.53,;10.01,-4.85,;10.48,-6.31,;11.04,-3.71,;10.57,-2.24,;11.6,-1.1,;9.06,-1.91,;13.63,3.98,;15.17,3.98,;15.94,2.63,;17.48,2.63,)|
Show InChI InChI=1S/C39H50N4O3/c1-25-17-26(2)19-30(18-25)37-36(27(3)21-40-16-15-29-9-14-35(44)42(22-29)24-46-6)33-20-31(10-13-34(33)41-37)39(4,5)38(45)43-23-28-7-11-32(43)12-8-28/h9-10,13-14,17-20,22,27-28,32,40-41H,7-8,11-12,15-16,21,23-24H2,1-6H3/t27-,28?,32?/m1/s1
n/an/a 3.90n/an/an/an/an/an/a
Merck Research Laboratories
Curated by ChEMBL
Assay Description
In vitro functional antagonism via inhibition of GnRH-stimulated phosphatidylinositol (PI) hydrolysis in cloned Chinese hamster ovary (CHO) cells sta...
Bioorg Med Chem Lett 11: 2597-602 (2001)
BindingDB Entry DOI: 10.7270/Q2NV9HKC