BDBM50104690 (4-Hexadecanoyl-3-hydroxy-5-oxo-2,5-dihydro-furan-2-yl)-acetic acid 4-benzoyl-phenyl ester::CHEMBL111092
SMILES: CCCCCCCCCCCCCCCC(=O)c1c(O)oc(CC(=O)Oc2ccc(cc2)C(=O)c2ccccc2)c1O
InChI Key: InChIKey=IJUKBEQOOLQDSL-UHFFFAOYSA-N
Data: 2 IC50
Activity Spreadsheet -- Enzyme Inhibition Constant Data from BindingDB
Found 2 hits for monomerid = 50104690
Trg + Lig
Ki
nM
ΔG°
kcal/mole
IC50
nM
Kd
nM
EC50/IC50
nM
koff
s-1
kon
M-1s-1
pHTemp
°C
Dual specificity phosphatase Cdc25B
(Mus musculus)
BDBM50104690
((4-Hexadecanoyl-3-hydroxy-5-oxo-2,5-dihydro-furan-...)
Show SMILES CCCCCCCCCCCCCCCC(=O)c1c(O)oc(CC(=O)Oc2ccc(cc2)C(=O)c2ccccc2)c1O
Show InChI InChI=1S/C35H44O7/c1-2-3-4-5-6-7-8-9-10-11-12-13-17-20-29(36)32-34(39)30(42-35(32)40)25-31(37)41-28-23-21-27(22-24-28)33(38)26-18-15-14-16-19-26/h14-16,18-19,21-24,39-40H,2-13,17,20,25H2,1H3
Reactome pathway
n/an/a 520n/an/an/an/an/an/a
Tohoku University
Curated by ChEMBL
Assay Description
Inhibitory activity against cell division cycle 25B
J Med Chem 44: 3216-22 (2001)
BindingDB Entry DOI: 10.7270/Q2WD3ZVR
Dual specificity protein phosphatase (VHR)
(Homo sapiens (Human))
BDBM50104690
((4-Hexadecanoyl-3-hydroxy-5-oxo-2,5-dihydro-furan-...)
Show SMILES CCCCCCCCCCCCCCCC(=O)c1c(O)oc(CC(=O)Oc2ccc(cc2)C(=O)c2ccccc2)c1O
Show InChI InChI=1S/C35H44O7/c1-2-3-4-5-6-7-8-9-10-11-12-13-17-20-29(36)32-34(39)30(42-35(32)40)25-31(37)41-28-23-21-27(22-24-28)33(38)26-18-15-14-16-19-26/h14-16,18-19,21-24,39-40H,2-13,17,20,25H2,1H3
Reactome pathway
n/an/a 4.60E+3n/an/an/an/an/an/a
Tohoku University
Curated by ChEMBL
Assay Description
Inhibitory activity against vaccinia VH1-related phosphatase(VHR)
J Med Chem 44: 3216-22 (2001)
BindingDB Entry DOI: 10.7270/Q2WD3ZVR