BDBM50104991 4-tert-Butyl-N-[6-[2-(5-chloro-pyrimidin-2-yloxy)-ethoxy]-5-(3-methoxy-phenoxy)-pyrimidin-4-yl]-benzenesulfonamide::CHEMBL114964
SMILES: COc1cccc(Oc2c(NS(=O)(=O)c3ccc(cc3)C(C)(C)C)ncnc2OCCOc2ncc(Cl)cn2)c1
InChI Key: InChIKey=POKACOFNIMWICU-UHFFFAOYSA-N
Data: 1 IC50
Activity Spreadsheet -- Enzyme Inhibition Constant Data from BindingDB
Found 1 hit for monomerid = 50104991
Trg + Lig
Ki
nM
ΔG°
kcal/mole
IC50
nM
Kd
nM
EC50/IC50
nM
koff
s-1
kon
M-1s-1
pHTemp
°C
Endothelin receptor ET-A
(Sus scrofa)
BDBM50104991
(4-tert-Butyl-N-[6-[2-(5-chloro-pyrimidin-2-yloxy)-...)
Show SMILES COc1cccc(Oc2c(NS(=O)(=O)c3ccc(cc3)C(C)(C)C)ncnc2OCCOc2ncc(Cl)cn2)c1
Show InChI InChI=1S/C27H28ClN5O6S/c1-27(2,3)18-8-10-22(11-9-18)40(34,35)33-24-23(39-21-7-5-6-20(14-21)36-4)25(32-17-31-24)37-12-13-38-26-29-15-19(28)16-30-26/h5-11,14-17H,12-13H2,1-4H3,(H,31,32,33)
Reactome pathway
n/an/a 0.0590n/an/an/an/an/an/a
Tanabe Seiyaku Co., Ltd.
Curated by ChEMBL
Assay Description
In vitro inhibition of [125I]-ET-1 binding to Endothelin A receptor in porcine aortic membrane from endothelial cells
J Med Chem 44: 3355-68 (2001)
BindingDB Entry DOI: 10.7270/Q2QN662B