BDBM50105338 (S)-2-[(S)-(3,4-Dichloro-phenyl)-hydroxy-methyl]-pyrrolidine-1-carboxylic acid {4-[(2,2-dimethyl-propionylamino)-methyl]-phenyl}-amide::CHEMBL91441
SMILES: CC(C)(C)C(=O)NCc1ccc(NC(=O)N2CCC[C@H]2[C@@H](O)c2ccc(Cl)c(Cl)c2)cc1
InChI Key: InChIKey=QLPPEGVHVWGOBY-SFTDATJTSA-N
Data: 1 IC50
Activity Spreadsheet -- Enzyme Inhibition Constant Data from BindingDB
Found 1 hit for monomerid = 50105338
Trg + Lig
Ki
nM
ΔG°
kcal/mole
IC50
nM
Kd
nM
EC50/IC50
nM
koff
s-1
kon
M-1s-1
pHTemp
°C
Proteinase-activated receptor 1
(Homo sapiens (Human))
BDBM50105338
((S)-2-[(S)-(3,4-Dichloro-phenyl)-hydroxy-methyl]-p...)
Show SMILES CC(C)(C)C(=O)NCc1ccc(NC(=O)N2CCC[C@H]2[C@@H](O)c2ccc(Cl)c(Cl)c2)cc1
Show InChI InChI=1S/C24H29Cl2N3O3/c1-24(2,3)22(31)27-14-15-6-9-17(10-7-15)28-23(32)29-12-4-5-20(29)21(30)16-8-11-18(25)19(26)13-16/h6-11,13,20-21,30H,4-5,12,14H2,1-3H3,(H,27,31)(H,28,32)/t20-,21-/m0/s1
n/an/a 1.10E+3n/an/an/an/an/an/a
Merck Research Laboratories
Curated by ChEMBL
Assay Description
Binding affinity of the compound against platelet thrombin receptor
Bioorg Med Chem Lett 11: 2691-6 (2001)
BindingDB Entry DOI: 10.7270/Q26Q1WJ1