BDBM50105464 2,7-Dimethyl-acridine-3,6-diamine::CHEMBL329221
SMILES: Cc1cc2cc3cc(C)c(N)cc3nc2cc1N
InChI Key: InChIKey=HGHJYCKSBMCGRK-UHFFFAOYSA-N
Data: 4 IC50
Activity Spreadsheet -- Enzyme Inhibition Constant Data from BindingDB
Found 4 hits for monomerid = 50105464
Trg + Lig
Ki
nM
ΔG°
kcal/mole
IC50
nM
Kd
nM
EC50/IC50
nM
koff
s-1
kon
M-1s-1
pHTemp
°C
Telomerase reverse transcriptase
(Homo sapiens (Human))
BDBM50105464
(2,7-Dimethyl-acridine-3,6-diamine | CHEMBL329221)
Show SMILES Cc1cc2cc3cc(C)c(N)cc3nc2cc1N
Show InChI InChI=1S/C15H15N3/c1-8-3-10-5-11-4-9(2)13(17)7-15(11)18-14(10)6-12(8)16/h3-7H,16-17H2,1-2H3
NCI pathway
Reactome pathway
n/an/a 2.17E+4n/an/an/an/an/an/a
University of Missouri
Curated by ChEMBL
Assay Description
Inhibitory activity of the compound against telomerase (Compound released from DNA/DNA heteroduplex derivatized resin [sequence (TTAGGG)3)
Bioorg Med Chem Lett 11: 2727-30 (2001)
BindingDB Entry DOI: 10.7270/Q2PN94XJ
Reverse transcriptase
(Human immunodeficiency virus 1)
BDBM50105464
(2,7-Dimethyl-acridine-3,6-diamine | CHEMBL329221)
Show SMILES Cc1cc2cc3cc(C)c(N)cc3nc2cc1N
Show InChI InChI=1S/C15H15N3/c1-8-3-10-5-11-4-9(2)13(17)7-15(11)18-14(10)6-12(8)16/h3-7H,16-17H2,1-2H3
n/an/a 3.20E+4n/an/an/an/an/an/a
University of Missouri
Curated by ChEMBL
Assay Description
Inhibition of HIV-1 reverse transcriptase using Poly(rA).p(dT) (12 to 18) as substrate after 30 mins by single point PCR assay
Bioorg Med Chem Lett 22: 4844-8 (2012)
Article DOI: 10.1016/j.bmcl.2012.05.041
BindingDB Entry DOI: 10.7270/Q2SJ1PG6
Telomerase reverse transcriptase
(Homo sapiens (Human))
BDBM50105464
(2,7-Dimethyl-acridine-3,6-diamine | CHEMBL329221)
Show SMILES Cc1cc2cc3cc(C)c(N)cc3nc2cc1N
Show InChI InChI=1S/C15H15N3/c1-8-3-10-5-11-4-9(2)13(17)7-15(11)18-14(10)6-12(8)16/h3-7H,16-17H2,1-2H3
NCI pathway
Reactome pathway
n/an/a 2.17E+4n/an/an/an/an/an/a
University of Missouri
Curated by ChEMBL
Assay Description
Inhibitory activity of the compound against telomerase (Compound released from RNA/DNA heteroduplex derivatized resin [sequence (TTAGGG)3)
Bioorg Med Chem Lett 11: 2727-30 (2001)
BindingDB Entry DOI: 10.7270/Q2PN94XJ
Telomerase reverse transcriptase
(Homo sapiens (Human))
BDBM50105464
(2,7-Dimethyl-acridine-3,6-diamine | CHEMBL329221)
Show SMILES Cc1cc2cc3cc(C)c(N)cc3nc2cc1N
Show InChI InChI=1S/C15H15N3/c1-8-3-10-5-11-4-9(2)13(17)7-15(11)18-14(10)6-12(8)16/h3-7H,16-17H2,1-2H3
NCI pathway
Reactome pathway
n/an/a 2.17E+4n/an/an/an/an/an/a
University of Missouri
Curated by ChEMBL
Assay Description
Inhibitory activity of the compound against telomerase (Compound released from underivatized resin
Bioorg Med Chem Lett 11: 2727-30 (2001)
BindingDB Entry DOI: 10.7270/Q2PN94XJ