BDBM50105468 (S)-6-Amino-2-[(R)-2-[(4-benzoyl-piperazine-1-carbonyl)-amino]-3-(1H-indol-3-yl)-propionylamino]-hexanoic acid tert-butyl ester::CHEMBL93304
SMILES: CC(C)(C)OC(=O)[C@H](CCCCN)NC(=O)[C@@H](Cc1c[nH]c2ccccc12)NC(=O)N1CCN(CC1)C(=O)c1ccccc1
InChI Key: InChIKey=PJSSGYOORDRLIP-WUFINQPMSA-N
Data: 2 IC50
Activity Spreadsheet -- Enzyme Inhibition Constant Data from BindingDB
Found 2 hits for monomerid = 50105468
Trg + Lig
Ki
nM
ΔG°
kcal/mole
IC50
nM
Kd
nM
EC50/IC50
nM
koff
s-1
kon
M-1s-1
pHTemp
°C
Somatostatin receptor type 2
(Homo sapiens (Human))
BDBM50105468
((S)-6-Amino-2-[(R)-2-[(4-benzoyl-piperazine-1-carb...)
Show SMILES CC(C)(C)OC(=O)[C@H](CCCCN)NC(=O)[C@@H](Cc1c[nH]c2ccccc12)NC(=O)N1CCN(CC1)C(=O)c1ccccc1
Show InChI InChI=1S/C33H44N6O5/c1-33(2,3)44-31(42)27(15-9-10-16-34)36-29(40)28(21-24-22-35-26-14-8-7-13-25(24)26)37-32(43)39-19-17-38(18-20-39)30(41)23-11-5-4-6-12-23/h4-8,11-14,22,27-28,35H,9-10,15-21,34H2,1-3H3,(H,36,40)(H,37,43)/t27-,28+/m0/s1
n/an/a 6.90n/an/an/an/an/an/a
Pfizer Inc
Curated by ChEMBL
Assay Description
Inhibitory concentration of the compound towards binding of sst2 receptor using [125I]-somatostatin as radioligand in Neuro2A cells
Bioorg Med Chem Lett 11: 2731-4 (2001)
BindingDB Entry DOI: 10.7270/Q2JW8D5S
Somatostatin receptor type 2
(Homo sapiens (Human))
BDBM50105468
((S)-6-Amino-2-[(R)-2-[(4-benzoyl-piperazine-1-carb...)
Show SMILES CC(C)(C)OC(=O)[C@H](CCCCN)NC(=O)[C@@H](Cc1c[nH]c2ccccc12)NC(=O)N1CCN(CC1)C(=O)c1ccccc1
Show InChI InChI=1S/C33H44N6O5/c1-33(2,3)44-31(42)27(15-9-10-16-34)36-29(40)28(21-24-22-35-26-14-8-7-13-25(24)26)37-32(43)39-19-17-38(18-20-39)30(41)23-11-5-4-6-12-23/h4-8,11-14,22,27-28,35H,9-10,15-21,34H2,1-3H3,(H,36,40)(H,37,43)/t27-,28+/m0/s1
n/an/a 1.60E+3n/an/an/an/an/an/a
Pfizer Inc
Curated by ChEMBL
Assay Description
Inhibitory concentration of the compound towards binding of sst2 receptor using [125I]-somatostatin as radioligand in Neuro2A cells
Bioorg Med Chem Lett 11: 2731-4 (2001)
BindingDB Entry DOI: 10.7270/Q2JW8D5S