BDBM50105503 Allyl-[1-((3S,4S)-1-benzoyl-4-phenyl-pyrrolidin-3-ylmethyl)-piperidin-4-yl]-carbamic acid 4-nitro-benzyl ester::CHEMBL431852
SMILES: [O-][N+](=O)c1ccc(COC(=O)N(CC=C)C2CCN(C[C@H]3CN(C[C@@H]3c3ccccc3)C(=O)c3ccccc3)CC2)cc1
InChI Key: InChIKey=PXSJHZDVAPTMRG-BHDXBOSCSA-N
Data: 1 IC50
Activity Spreadsheet -- Enzyme Inhibition Constant Data from BindingDB
Found 1 hit for monomerid = 50105503
Trg + Lig
Ki
nM
ΔG°
kcal/mole
IC50
nM
Kd
nM
EC50/IC50
nM
koff
s-1
kon
M-1s-1
pHTemp
°C
C-C chemokine receptor type 5
(Homo sapiens (Human))
BDBM50105503
(Allyl-[1-((3S,4S)-1-benzoyl-4-phenyl-pyrrolidin-3-...)
Show SMILES [O-][N+](=O)c1ccc(COC(=O)N(CC=C)C2CCN(C[C@H]3CN(C[C@@H]3c3ccccc3)C(=O)c3ccccc3)CC2)cc1
Show InChI InChI=1S/C34H38N4O5/c1-2-19-37(34(40)43-25-26-13-15-31(16-14-26)38(41)42)30-17-20-35(21-18-30)22-29-23-36(33(39)28-11-7-4-8-12-28)24-32(29)27-9-5-3-6-10-27/h2-16,29-30,32H,1,17-25H2/t29-,32+/m0/s1
n/an/a 0.200n/an/an/an/an/an/a
Merck Research Laboratories
Curated by ChEMBL
Assay Description
Inhibitory concentration, binding towards C-C chemokine receptor type 5 using [125I]-MIP-1 alpha as radioligand expressed on CHO cells
Bioorg Med Chem Lett 11: 2741-5 (2001)
BindingDB Entry DOI: 10.7270/Q2F47NFC