BDBM50105612 5-Isopropyl-3-(3-p-tolyl-ureido)-thiophene-2-carboxylic acid methyl ester::CHEMBL18848::methyl 5-isopropyl-3-(3-p-tolylureido)thiophene-2-carboxylate
SMILES: COC(=O)c1sc(cc1NC(=O)Nc1ccc(C)cc1)C(C)C
InChI Key: InChIKey=XSEQAKHTJDAGQH-UHFFFAOYSA-N
Data: 2 IC50
Activity Spreadsheet -- Enzyme Inhibition Constant Data from BindingDB
Found 2 hits for monomerid = 50105612
Trg + Lig
Ki
nM
ΔG°
kcal/mole
IC50
nM
Kd
nM
EC50/IC50
nM
koff
s-1
kon
M-1s-1
pHTemp
°C
RAF proto-oncogene serine/threonine-protein kinase
(Homo sapiens (Human))
BDBM50105612
(5-Isopropyl-3-(3-p-tolyl-ureido)-thiophene-2-carbo...)
Show SMILES COC(=O)c1sc(cc1NC(=O)Nc1ccc(C)cc1)C(C)C
Show InChI InChI=1S/C17H20N2O3S/c1-10(2)14-9-13(15(23-14)16(20)22-4)19-17(21)18-12-7-5-11(3)6-8-12/h5-10H,1-4H3,(H2,18,19,21)
NCI pathway
Reactome pathway
n/an/a 4.00E+3n/an/an/an/an/an/a
Bayer Research Center
Curated by ChEMBL
Assay Description
Inhibitory concentration against raf kinase.
Bioorg Med Chem Lett 11: 2775-8 (2001)
BindingDB Entry DOI: 10.7270/Q2NS0VD5
RAF proto-oncogene serine/threonine-protein kinase
(Homo sapiens (Human))
BDBM50105612
(5-Isopropyl-3-(3-p-tolyl-ureido)-thiophene-2-carbo...)
Show SMILES COC(=O)c1sc(cc1NC(=O)Nc1ccc(C)cc1)C(C)C
Show InChI InChI=1S/C17H20N2O3S/c1-10(2)14-9-13(15(23-14)16(20)22-4)19-17(21)18-12-7-5-11(3)6-8-12/h5-10H,1-4H3,(H2,18,19,21)
NCI pathway
Reactome pathway
n/an/a 4.00E+3n/an/an/an/an/an/a
China Pharmaceutical University
Curated by ChEMBL
Assay Description
Inhibition of B-Raf1 (unknown origin)
Eur J Med Chem 44: 1240-9 (2009)
Article DOI: 10.1016/j.ejmech.2008.09.016
BindingDB Entry DOI: 10.7270/Q28G8KJ5