BDBM50106165 (3-tert-Butyl-pyrrolidin-1-yl)-(4-hexyloxy-phenyl)-methanone::CHEMBL121822
SMILES: CCCCCCOc1ccc(cc1)C(=O)N1CCC(C1)C(C)(C)C
InChI Key: InChIKey=MFKDNMHZILMJII-UHFFFAOYSA-N
Data: 1 IC50
Activity Spreadsheet -- Enzyme Inhibition Constant Data from BindingDB
Found 1 hit for monomerid = 50106165
Trg + Lig
Ki
nM
ΔG°
kcal/mole
IC50
nM
Kd
nM
EC50/IC50
nM
koff
s-1
kon
M-1s-1
pHTemp
°C
Voltage-gated potassium channel subunit Kv7.1
(Cavia porcellus)
BDBM50106165
((3-tert-Butyl-pyrrolidin-1-yl)-(4-hexyloxy-phenyl)...)
Show SMILES CCCCCCOc1ccc(cc1)C(=O)N1CCC(C1)C(C)(C)C
Show InChI InChI=1S/C21H33NO2/c1-5-6-7-8-15-24-19-11-9-17(10-12-19)20(23)22-14-13-18(16-22)21(2,3)4/h9-12,18H,5-8,13-16H2,1-4H3
n/an/a>3.00E+3n/an/an/an/an/an/a
TBA
Curated by ChEMBL
Assay Description
Molar concentration required to inhibit 50% of the activating delayed-rectifier K+ current in isolated guinea pig ventricularmyocytes
J Med Chem 44: 3764-7 (2001)
BindingDB Entry DOI: 10.7270/Q2G1604C