BDBM50106229 CHEMBL127435::Ethanesulfonic acid (6-fluoro-3-hydroxy-2,2-dimethyl-chroman-4-yl)-methyl-amide
SMILES: CCS(=O)(=O)N(C)C1C(O)C(C)(C)Oc2ccc(F)cc12
InChI Key: InChIKey=OHZDQMLJSUBQLE-UHFFFAOYSA-N
Data: 1 IC50
Activity Spreadsheet -- Enzyme Inhibition Constant Data from BindingDB
Found 1 hit for monomerid = 50106229
Trg + Lig
Ki
nM
ΔG°
kcal/mole
IC50
nM
Kd
nM
EC50/IC50
nM
koff
s-1
kon
M-1s-1
pHTemp
°C
Voltage-gated potassium channel beta subunit Mink/subunit Kv7.1
(Homo sapiens (Human))
BDBM50106229
(CHEMBL127435 | Ethanesulfonic acid (6-fluoro-3-hyd...)
Show SMILES CCS(=O)(=O)N(C)C1C(O)C(C)(C)Oc2ccc(F)cc12
Show InChI InChI=1S/C14H20FNO4S/c1-5-21(18,19)16(4)12-10-8-9(15)6-7-11(10)20-14(2,3)13(12)17/h6-8,12-13,17H,5H2,1-4H3
n/an/a 1.20E+3n/an/an/an/an/an/a
Aventis Pharma Deutschland GmbH
Curated by ChEMBL
Assay Description
Inhibition of human IKs-channel expressed in Xenopus oocytes
J Med Chem 44: 3831-7 (2001)
BindingDB Entry DOI: 10.7270/Q26H4GPX