null
SMILES: CCN1CCC(COCc2cc(cc(c2)C(F)(F)F)-c2ccc(cc2)C#N)(CC1)c1ccccc1
InChI Key: InChIKey=HNLCQMZJSHLFJU-UHFFFAOYSA-N
Activity Spreadsheet -- Enzyme Inhibition Constant Data from BindingDB
Found 1 hit for monomerid = 50106366
Trg + Lig
Ki
nM
ΔG°
kcal/mole
IC50
nM
Kd
nM
EC50/IC50
nM
koff
s-1
kon
M-1s-1
pHTemp
°C
Substance-P receptor
(Rattus norvegicus (rat))
BDBM50106366
(CHEMBL3596493)
Show SMILES CCN1CCC(COCc2cc(cc(c2)C(F)(F)F)-c2ccc(cc2)C#N)(CC1)c1ccccc1
Show InChI InChI=1S/C29H29F3N2O/c1-2-34-14-12-28(13-15-34,26-6-4-3-5-7-26)21-35-20-23-16-25(18-27(17-23)29(30,31)32)24-10-8-22(19-33)9-11-24/h3-11,16-18H,2,12-15,20-21H2,1H3
Reactome pathway
n/an/a 0.25n/an/an/an/an/an/a
Bristol-Myers Squibb Co.
Curated by ChEMBL
Assay Description
Displacement of [125I]-substance P from gerbil NK1 receptor expressed in HEK293 cell membranes incubated for 30 mins by liquid scintillation counting...
Bioorg Med Chem Lett 25: 3039-43 (2015)
BindingDB Entry DOI: 10.7270/Q24M9690