BDBM50106383 CHEMBL3596471
SMILES: Oc1cccc(c1)-c1cc(COCC2(CCNCC2)c2ccccc2)cc(c1)C(F)(F)F
InChI Key: InChIKey=JIUPIJUTJMZDMM-UHFFFAOYSA-N
Data: 1 IC50
Activity Spreadsheet -- Enzyme Inhibition Constant Data from BindingDB
Found 1 hit for monomerid = 50106383
Trg + Lig
Ki
nM
ΔG°
kcal/mole
IC50
nM
Kd
nM
EC50/IC50
nM
koff
s-1
kon
M-1s-1
pHTemp
°C
Neurokinin 1 receptor
(Rattus norvegicus (rat))
BDBM50106383
(CHEMBL3596471)
Show SMILES Oc1cccc(c1)-c1cc(COCC2(CCNCC2)c2ccccc2)cc(c1)C(F)(F)F
Show InChI InChI=1S/C26H26F3NO2/c27-26(28,29)23-14-19(13-21(15-23)20-5-4-8-24(31)16-20)17-32-18-25(9-11-30-12-10-25)22-6-2-1-3-7-22/h1-8,13-16,30-31H,9-12,17-18H2
Reactome pathway
n/an/a 13n/an/an/an/an/an/a
Bristol-Myers Squibb Co.
Curated by ChEMBL
Assay Description
Displacement of [125I]-substance P from gerbil NK1 receptor expressed in HEK293 cell membranes incubated for 30 mins by liquid scintillation counting...
Bioorg Med Chem Lett 25: 3039-43 (2015)
BindingDB Entry DOI: 10.7270/Q24M9690