null
SMILES: Cn1cc(cn1)-c1ccc2nc(N)sc2c1
InChI Key: InChIKey=RPSUOVPWIGAZEJ-UHFFFAOYSA-N
Activity Spreadsheet -- Enzyme Inhibition Constant Data from BindingDB
Found 7 hits for monomerid = 50107013
Trg + Lig
Ki
nM
ΔG°
kcal/mole
IC50
nM
Kd
nM
EC50/IC50
nM
koff
s-1
kon
M-1s-1
pHTemp
°C
Phosphatidylinositol 4,5-bisphosphate 3-kinase catalytic subunit gamma isoform
(Homo sapiens (Human))
BDBM50107013
(CHEMBL3600770)
Show SMILES Cn1cc(cn1)-c1ccc2nc(N)sc2c1
Show InChI InChI=1S/C11H10N4S/c1-15-6-8(5-13-15)7-2-3-9-10(4-7)16-11(12)14-9/h2-6H,1H3,(H2,12,14)
NCI pathway
Reactome pathway
n/an/a 2.51E+3n/an/an/an/an/an/a
AstraZeneca
Curated by ChEMBL
Assay Description
Inhibition of PI3Kgamma (unknown origin) pre-incubated for 20 mins before phosphatidylinositol 4, 5-bisphosphate substrate addition by kinase-glo plu...
Bioorg Med Chem Lett 25: 3189-93 (2015)
Article DOI: 10.1016/j.bmcl.2015.05.093
BindingDB Entry DOI: 10.7270/Q2KK9DKR
Phosphatidylinositol 4,5-bisphosphate 3-kinase catalytic subunit delta isoform
(Homo sapiens (Human))
BDBM50107013
(CHEMBL3600770)
Show SMILES Cn1cc(cn1)-c1ccc2nc(N)sc2c1
Show InChI InChI=1S/C11H10N4S/c1-15-6-8(5-13-15)7-2-3-9-10(4-7)16-11(12)14-9/h2-6H,1H3,(H2,12,14)
NCI pathway
Reactome pathway
n/an/a 7.94E+3n/an/an/an/an/an/a
AstraZeneca
Curated by ChEMBL
Assay Description
Inhibition of PI3Kdelta (unknown origin) pre-incubated for 20 mins before phosphatidylinositol 4, 5-bisphosphate substrate addition by kinase-glo plu...
Bioorg Med Chem Lett 25: 3189-93 (2015)
Article DOI: 10.1016/j.bmcl.2015.05.093
BindingDB Entry DOI: 10.7270/Q2KK9DKR
Phosphatidylinositol 4-phosphate 5-kinase type-1 gamma
(Homo sapiens (Human))
BDBM50107013
(CHEMBL3600770)
Show SMILES Cn1cc(cn1)-c1ccc2nc(N)sc2c1
Show InChI InChI=1S/C11H10N4S/c1-15-6-8(5-13-15)7-2-3-9-10(4-7)16-11(12)14-9/h2-6H,1H3,(H2,12,14)
Reactome pathway
n/an/a<1.00E+5n/an/an/an/an/an/a
AstraZeneca
Curated by ChEMBL
Assay Description
Inhibition of PIP5K1C (unknown origin) using D-myo-phosphatidylinositol 4-phosphate substrate and ATP by ADP-Glo kinase Assay
Bioorg Med Chem Lett 25: 3189-93 (2015)
Article DOI: 10.1016/j.bmcl.2015.05.093
BindingDB Entry DOI: 10.7270/Q2KK9DKR
Phosphatidylinositol 4,5-bisphosphate 3-kinase catalytic subunit beta isoform
(Homo sapiens (Human))
BDBM50107013
(CHEMBL3600770)
Show SMILES Cn1cc(cn1)-c1ccc2nc(N)sc2c1
Show InChI InChI=1S/C11H10N4S/c1-15-6-8(5-13-15)7-2-3-9-10(4-7)16-11(12)14-9/h2-6H,1H3,(H2,12,14)
NCI pathway
Reactome pathway
n/an/a 1.58E+4n/an/an/an/an/an/a
AstraZeneca
Curated by ChEMBL
Assay Description
Inhibition of PI3Kbeta (unknown origin) pre-incubated for 20 mins before phosphatidylinositol 4, 5-bisphosphate substrate addition by kinase-glo plus...
Bioorg Med Chem Lett 25: 3189-93 (2015)
Article DOI: 10.1016/j.bmcl.2015.05.093
BindingDB Entry DOI: 10.7270/Q2KK9DKR
Phosphatidylinositol 4-kinase alpha
(Homo sapiens (Human))
BDBM50107013
(CHEMBL3600770)
Show SMILES Cn1cc(cn1)-c1ccc2nc(N)sc2c1
Show InChI InChI=1S/C11H10N4S/c1-15-6-8(5-13-15)7-2-3-9-10(4-7)16-11(12)14-9/h2-6H,1H3,(H2,12,14)
n/an/a 2.51E+3n/an/an/an/an/an/a
AstraZeneca
Curated by ChEMBL
Assay Description
Inhibition of N-terminal FLAG-tagged human full length recombinant PI4K3alpha using D-myo-phosphatidylinositol substrate and ATP incubated for 45 min...
Bioorg Med Chem Lett 25: 3189-93 (2015)
Article DOI: 10.1016/j.bmcl.2015.05.093
BindingDB Entry DOI: 10.7270/Q2KK9DKR
Phosphatidylinositol 4,5-bisphosphate 3-kinase catalytic subunit alpha isoform
(Homo sapiens (Human))
BDBM50107013
(CHEMBL3600770)
Show SMILES Cn1cc(cn1)-c1ccc2nc(N)sc2c1
Show InChI InChI=1S/C11H10N4S/c1-15-6-8(5-13-15)7-2-3-9-10(4-7)16-11(12)14-9/h2-6H,1H3,(H2,12,14)
NCI pathway
Reactome pathway
n/an/a 7.94E+3n/an/an/an/an/an/a
AstraZeneca
Curated by ChEMBL
Assay Description
Inhibition of PI3Kalpha (unknown origin) pre-incubated for 20 mins before phosphatidylinositol 4, 5-bisphosphate substrate addition by kinase-glo plu...
Bioorg Med Chem Lett 25: 3189-93 (2015)
Article DOI: 10.1016/j.bmcl.2015.05.093
BindingDB Entry DOI: 10.7270/Q2KK9DKR
Phosphatidylinositol 4-kinase beta
(Homo sapiens (Human))
BDBM50107013
(CHEMBL3600770)
Show SMILES Cn1cc(cn1)-c1ccc2nc(N)sc2c1
Show InChI InChI=1S/C11H10N4S/c1-15-6-8(5-13-15)7-2-3-9-10(4-7)16-11(12)14-9/h2-6H,1H3,(H2,12,14)
n/an/a 1.26E+3n/an/an/an/an/an/a
AstraZeneca
Curated by ChEMBL
Assay Description
Inhibition of N-terminal GST-tagged human full length recombinant PI4K3beta expressed in Sf9 cells using D-myo-phosphatidylinositol substrate and ATP...
Bioorg Med Chem Lett 25: 3189-93 (2015)
Article DOI: 10.1016/j.bmcl.2015.05.093
BindingDB Entry DOI: 10.7270/Q2KK9DKR