null
SMILES: COc1ccccc1Sc1ccc(\C=C\C(=O)N2CCOCC2)cc1Cl
InChI Key: InChIKey=HANCDWQKPIEEQU-VQHVLOKHSA-N
Activity Spreadsheet -- Enzyme Inhibition Constant Data from BindingDB
Found 2 hits for monomerid = 50107182
Trg + Lig
Ki
nM
ΔG°
kcal/mole
IC50
nM
Kd
nM
EC50/IC50
nM
koff
s-1
kon
M-1s-1
pHTemp
°C
Integrin alpha-L
(Homo sapiens (Human))
BDBM50107182
(3-[3-Chloro-4-(2-methoxy-phenylsulfanyl)-phenyl]-1...)
Show SMILES COc1ccccc1Sc1ccc(\C=C\C(=O)N2CCOCC2)cc1Cl
Show InChI InChI=1S/C20H20ClNO3S/c1-24-17-4-2-3-5-19(17)26-18-8-6-15(14-16(18)21)7-9-20(23)22-10-12-25-13-11-22/h2-9,14H,10-13H2,1H3/b9-7+
NCI pathway
Reactome pathway
n/an/a 150n/an/an/an/an/an/a
Abbott Laboratories
Curated by ChEMBL
Assay Description
Inhibition of intercellular adhesion molecule-1 (ICAM-1) binding to recombinant LFA-1, range(130-170)
J Med Chem 44: 4393-403 (2001)
BindingDB Entry DOI: 10.7270/Q2WW7GZN
Integrin alpha-L/beta-2
(Homo sapiens (Human))
BDBM50107182
(3-[3-Chloro-4-(2-methoxy-phenylsulfanyl)-phenyl]-1...)
Show SMILES COc1ccccc1Sc1ccc(\C=C\C(=O)N2CCOCC2)cc1Cl
Show InChI InChI=1S/C20H20ClNO3S/c1-24-17-4-2-3-5-19(17)26-18-8-6-15(14-16(18)21)7-9-20(23)22-10-12-25-13-11-22/h2-9,14H,10-13H2,1H3/b9-7+
n/an/a 40n/an/an/an/an/an/a
Abbott Laboratories
Curated by ChEMBL
Assay Description
Inhibition of LFA-1 mediated JY-8 cell adhesion to ICAM-1, range (6-100)
J Med Chem 44: 4393-403 (2001)
BindingDB Entry DOI: 10.7270/Q2WW7GZN