BDBM50107243 CHEMBL3600779
SMILES: Nc1nc2ccc(cc2s1)-c1ccn(CC2CC2)c(=O)c1
InChI Key: InChIKey=RWQUSQUPWBEBAN-UHFFFAOYSA-N
Data: 7 IC50
Activity Spreadsheet -- Enzyme Inhibition Constant Data from BindingDB
Found 7 hits for monomerid = 50107243
Trg + Lig
Ki
nM
ΔG°
kcal/mole
IC50
nM
Kd
nM
EC50/IC50
nM
koff
s-1
kon
M-1s-1
pHTemp
°C
Phosphatidylinositol 4,5-bisphosphate 3-kinase catalytic subunit beta isoform
(Homo sapiens (Human))
BDBM50107243
(CHEMBL3600779)
Show SMILES Nc1nc2ccc(cc2s1)-c1ccn(CC2CC2)c(=O)c1
Show InChI InChI=1S/C16H15N3OS/c17-16-18-13-4-3-11(7-14(13)21-16)12-5-6-19(15(20)8-12)9-10-1-2-10/h3-8,10H,1-2,9H2,(H2,17,18)
NCI pathway
Reactome pathway
n/an/a<1.26E+5n/an/an/an/an/an/a
AstraZeneca
Curated by ChEMBL
Assay Description
Inhibition of PI3Kbeta (unknown origin) pre-incubated for 20 mins before phosphatidylinositol 4, 5-bisphosphate substrate addition by kinase-glo plus...
Bioorg Med Chem Lett 25: 3189-93 (2015)
BindingDB Entry DOI: 10.7270/Q2KK9DKR
Phosphatidylinositol 4,5-bisphosphate 3-kinase catalytic subunit gamma isoform
(Homo sapiens (Human))
BDBM50107243
(CHEMBL3600779)
Show SMILES Nc1nc2ccc(cc2s1)-c1ccn(CC2CC2)c(=O)c1
Show InChI InChI=1S/C16H15N3OS/c17-16-18-13-4-3-11(7-14(13)21-16)12-5-6-19(15(20)8-12)9-10-1-2-10/h3-8,10H,1-2,9H2,(H2,17,18)
NCI pathway
Reactome pathway
n/an/a 1.59E+3n/an/an/an/an/an/a
AstraZeneca
Curated by ChEMBL
Assay Description
Inhibition of PI3Kgamma (unknown origin) pre-incubated for 20 mins before phosphatidylinositol 4, 5-bisphosphate substrate addition by kinase-glo plu...
Bioorg Med Chem Lett 25: 3189-93 (2015)
BindingDB Entry DOI: 10.7270/Q2KK9DKR
Phosphatidylinositol 4,5-bisphosphate 3-kinase catalytic subunit delta isoform
(Homo sapiens (Human))
BDBM50107243
(CHEMBL3600779)
Show SMILES Nc1nc2ccc(cc2s1)-c1ccn(CC2CC2)c(=O)c1
Show InChI InChI=1S/C16H15N3OS/c17-16-18-13-4-3-11(7-14(13)21-16)12-5-6-19(15(20)8-12)9-10-1-2-10/h3-8,10H,1-2,9H2,(H2,17,18)
NCI pathway
Reactome pathway
n/an/a 1.26E+4n/an/an/an/an/an/a
AstraZeneca
Curated by ChEMBL
Assay Description
Inhibition of PI3Kdelta (unknown origin) pre-incubated for 20 mins before phosphatidylinositol 4, 5-bisphosphate substrate addition by kinase-glo plu...
Bioorg Med Chem Lett 25: 3189-93 (2015)
BindingDB Entry DOI: 10.7270/Q2KK9DKR
Phosphatidylinositol 4,5-bisphosphate 3-kinase catalytic subunit alpha isoform
(Homo sapiens (Human))
BDBM50107243
(CHEMBL3600779)
Show SMILES Nc1nc2ccc(cc2s1)-c1ccn(CC2CC2)c(=O)c1
Show InChI InChI=1S/C16H15N3OS/c17-16-18-13-4-3-11(7-14(13)21-16)12-5-6-19(15(20)8-12)9-10-1-2-10/h3-8,10H,1-2,9H2,(H2,17,18)
NCI pathway
Reactome pathway
n/an/a 6.31E+3n/an/an/an/an/an/a
AstraZeneca
Curated by ChEMBL
Assay Description
Inhibition of PI3Kalpha (unknown origin) pre-incubated for 20 mins before phosphatidylinositol 4, 5-bisphosphate substrate addition by kinase-glo plu...
Bioorg Med Chem Lett 25: 3189-93 (2015)
BindingDB Entry DOI: 10.7270/Q2KK9DKR
Phosphatidylinositol 4-kinase beta
(Homo sapiens (Human))
BDBM50107243
(CHEMBL3600779)
Show SMILES Nc1nc2ccc(cc2s1)-c1ccn(CC2CC2)c(=O)c1
Show InChI InChI=1S/C16H15N3OS/c17-16-18-13-4-3-11(7-14(13)21-16)12-5-6-19(15(20)8-12)9-10-1-2-10/h3-8,10H,1-2,9H2,(H2,17,18)
n/an/a 1.59E+3n/an/an/an/an/an/a
AstraZeneca
Curated by ChEMBL
Assay Description
Inhibition of N-terminal GST-tagged human full length recombinant PI4K3beta expressed in Sf9 cells using D-myo-phosphatidylinositol substrate and ATP...
Bioorg Med Chem Lett 25: 3189-93 (2015)
BindingDB Entry DOI: 10.7270/Q2KK9DKR
Phosphatidylinositol 4-kinase alpha (PI4KA)
(Homo sapiens (Human))
BDBM50107243
(CHEMBL3600779)
Show SMILES Nc1nc2ccc(cc2s1)-c1ccn(CC2CC2)c(=O)c1
Show InChI InChI=1S/C16H15N3OS/c17-16-18-13-4-3-11(7-14(13)21-16)12-5-6-19(15(20)8-12)9-10-1-2-10/h3-8,10H,1-2,9H2,(H2,17,18)
n/an/a 6.30n/an/an/an/an/an/a
AstraZeneca
Curated by ChEMBL
Assay Description
Inhibition of N-terminal FLAG-tagged human full length recombinant PI4K3alpha using D-myo-phosphatidylinositol substrate and ATP incubated for 45 min...
Bioorg Med Chem Lett 25: 3189-93 (2015)
BindingDB Entry DOI: 10.7270/Q2KK9DKR
Phosphatidylinositol-4-phosphate 5-kinase type-1 gamma
(Homo sapiens (Human))
BDBM50107243
(CHEMBL3600779)
Show SMILES Nc1nc2ccc(cc2s1)-c1ccn(CC2CC2)c(=O)c1
Show InChI InChI=1S/C16H15N3OS/c17-16-18-13-4-3-11(7-14(13)21-16)12-5-6-19(15(20)8-12)9-10-1-2-10/h3-8,10H,1-2,9H2,(H2,17,18)
Reactome pathway
n/an/a<7.94E+4n/an/an/an/an/an/a
AstraZeneca
Curated by ChEMBL
Assay Description
Inhibition of PIP5K1C (unknown origin) using D-myo-phosphatidylinositol 4-phosphate substrate and ATP by ADP-Glo kinase Assay
Bioorg Med Chem Lett 25: 3189-93 (2015)
BindingDB Entry DOI: 10.7270/Q2KK9DKR