BDBM50107266 CHEMBL3600691
SMILES: Cc1ccc(cn1)-c1ccc2nc(N)sc2c1
InChI Key: InChIKey=JUOONRVZCOKLQK-UHFFFAOYSA-N
Data: 7 IC50
Activity Spreadsheet -- Enzyme Inhibition Constant Data from BindingDB
Found 7 hits for monomerid = 50107266
Trg + Lig
Ki
nM
ΔG°
kcal/mole
IC50
nM
Kd
nM
EC50/IC50
nM
koff
s-1
kon
M-1s-1
pHTemp
°C
Phosphatidylinositol 4,5-bisphosphate 3-kinase catalytic subunit gamma isoform
(Homo sapiens (Human))
BDBM50107266
(CHEMBL3600691)
Show SMILES Cc1ccc(cn1)-c1ccc2nc(N)sc2c1
Show InChI InChI=1S/C13H11N3S/c1-8-2-3-10(7-15-8)9-4-5-11-12(6-9)17-13(14)16-11/h2-7H,1H3,(H2,14,16)
NCI pathway
Reactome pathway
n/an/a 1.26E+3n/an/an/an/an/an/a
AstraZeneca
Curated by ChEMBL
Assay Description
Inhibition of PI3Kgamma (unknown origin) pre-incubated for 20 mins before phosphatidylinositol 4, 5-bisphosphate substrate addition by kinase-glo plu...
Bioorg Med Chem Lett 25: 3189-93 (2015)
BindingDB Entry DOI: 10.7270/Q2KK9DKR
Phosphatidylinositol 4,5-bisphosphate 3-kinase catalytic subunit delta isoform
(Homo sapiens (Human))
BDBM50107266
(CHEMBL3600691)
Show SMILES Cc1ccc(cn1)-c1ccc2nc(N)sc2c1
Show InChI InChI=1S/C13H11N3S/c1-8-2-3-10(7-15-8)9-4-5-11-12(6-9)17-13(14)16-11/h2-7H,1H3,(H2,14,16)
NCI pathway
Reactome pathway
n/an/a 1.26E+3n/an/an/an/an/an/a
AstraZeneca
Curated by ChEMBL
Assay Description
Inhibition of PI3Kdelta (unknown origin) pre-incubated for 20 mins before phosphatidylinositol 4, 5-bisphosphate substrate addition by kinase-glo plu...
Bioorg Med Chem Lett 25: 3189-93 (2015)
BindingDB Entry DOI: 10.7270/Q2KK9DKR
Phosphatidylinositol-4-phosphate 5-kinase type-1 gamma
(Homo sapiens (Human))
BDBM50107266
(CHEMBL3600691)
Show SMILES Cc1ccc(cn1)-c1ccc2nc(N)sc2c1
Show InChI InChI=1S/C13H11N3S/c1-8-2-3-10(7-15-8)9-4-5-11-12(6-9)17-13(14)16-11/h2-7H,1H3,(H2,14,16)
Reactome pathway
n/an/a<1.00E+5n/an/an/an/an/an/a
AstraZeneca
Curated by ChEMBL
Assay Description
Inhibition of PIP5K1C (unknown origin) using D-myo-phosphatidylinositol 4-phosphate substrate and ATP by ADP-Glo kinase Assay
Bioorg Med Chem Lett 25: 3189-93 (2015)
BindingDB Entry DOI: 10.7270/Q2KK9DKR
Phosphatidylinositol 4,5-bisphosphate 3-kinase catalytic subunit beta isoform
(Homo sapiens (Human))
BDBM50107266
(CHEMBL3600691)
Show SMILES Cc1ccc(cn1)-c1ccc2nc(N)sc2c1
Show InChI InChI=1S/C13H11N3S/c1-8-2-3-10(7-15-8)9-4-5-11-12(6-9)17-13(14)16-11/h2-7H,1H3,(H2,14,16)
NCI pathway
Reactome pathway
n/an/a 2.51E+3n/an/an/an/an/an/a
AstraZeneca
Curated by ChEMBL
Assay Description
Inhibition of PI3Kbeta (unknown origin) pre-incubated for 20 mins before phosphatidylinositol 4, 5-bisphosphate substrate addition by kinase-glo plus...
Bioorg Med Chem Lett 25: 3189-93 (2015)
BindingDB Entry DOI: 10.7270/Q2KK9DKR
Phosphatidylinositol 4-kinase beta
(Homo sapiens (Human))
BDBM50107266
(CHEMBL3600691)
Show SMILES Cc1ccc(cn1)-c1ccc2nc(N)sc2c1
Show InChI InChI=1S/C13H11N3S/c1-8-2-3-10(7-15-8)9-4-5-11-12(6-9)17-13(14)16-11/h2-7H,1H3,(H2,14,16)
n/an/a 501n/an/an/an/an/an/a
AstraZeneca
Curated by ChEMBL
Assay Description
Inhibition of N-terminal GST-tagged human full length recombinant PI4K3beta expressed in Sf9 cells using D-myo-phosphatidylinositol substrate and ATP...
Bioorg Med Chem Lett 25: 3189-93 (2015)
BindingDB Entry DOI: 10.7270/Q2KK9DKR
Phosphatidylinositol 4-kinase alpha (PI4KA)
(Homo sapiens (Human))
BDBM50107266
(CHEMBL3600691)
Show SMILES Cc1ccc(cn1)-c1ccc2nc(N)sc2c1
Show InChI InChI=1S/C13H11N3S/c1-8-2-3-10(7-15-8)9-4-5-11-12(6-9)17-13(14)16-11/h2-7H,1H3,(H2,14,16)
n/an/a 1.59E+3n/an/an/an/an/an/a
AstraZeneca
Curated by ChEMBL
Assay Description
Inhibition of N-terminal FLAG-tagged human full length recombinant PI4K3alpha using D-myo-phosphatidylinositol substrate and ATP incubated for 45 min...
Bioorg Med Chem Lett 25: 3189-93 (2015)
BindingDB Entry DOI: 10.7270/Q2KK9DKR
Phosphatidylinositol 4,5-bisphosphate 3-kinase catalytic subunit alpha isoform
(Homo sapiens (Human))
BDBM50107266
(CHEMBL3600691)
Show SMILES Cc1ccc(cn1)-c1ccc2nc(N)sc2c1
Show InChI InChI=1S/C13H11N3S/c1-8-2-3-10(7-15-8)9-4-5-11-12(6-9)17-13(14)16-11/h2-7H,1H3,(H2,14,16)
NCI pathway
Reactome pathway
n/an/a 1.00E+3n/an/an/an/an/an/a
AstraZeneca
Curated by ChEMBL
Assay Description
Inhibition of PI3Kalpha (unknown origin) pre-incubated for 20 mins before phosphatidylinositol 4, 5-bisphosphate substrate addition by kinase-glo plu...
Bioorg Med Chem Lett 25: 3189-93 (2015)
BindingDB Entry DOI: 10.7270/Q2KK9DKR