BDBM50107276 CHEMBL3600696
SMILES: CNC(=O)c1ccc(cn1)-c1ccc2nc(N)sc2c1
InChI Key: InChIKey=HLYCMIUSQBLQAY-UHFFFAOYSA-N
Data: 4 IC50
Activity Spreadsheet -- Enzyme Inhibition Constant Data from BindingDB
Found 4 hits for monomerid = 50107276
Trg + Lig
Ki
nM
ΔG°
kcal/mole
IC50
nM
Kd
nM
EC50/IC50
nM
koff
s-1
kon
M-1s-1
pHTemp
°C
Phosphatidylinositol-4-phosphate 5-kinase type-1 gamma
(Homo sapiens (Human))
BDBM50107276
(CHEMBL3600696)
Show SMILES CNC(=O)c1ccc(cn1)-c1ccc2nc(N)sc2c1
Show InChI InChI=1S/C14H12N4OS/c1-16-13(19)11-5-3-9(7-17-11)8-2-4-10-12(6-8)20-14(15)18-10/h2-7H,1H3,(H2,15,18)(H,16,19)
Reactome pathway
n/an/a 3.16E+4n/an/an/an/an/an/a
AstraZeneca
Curated by ChEMBL
Assay Description
Inhibition of PIP5K1C (unknown origin) using D-myo-phosphatidylinositol 4-phosphate substrate and ATP by ADP-Glo kinase Assay
Bioorg Med Chem Lett 25: 3189-93 (2015)
BindingDB Entry DOI: 10.7270/Q2KK9DKR
Phosphatidylinositol 4-kinase alpha (PI4KA)
(Homo sapiens (Human))
BDBM50107276
(CHEMBL3600696)
Show SMILES CNC(=O)c1ccc(cn1)-c1ccc2nc(N)sc2c1
Show InChI InChI=1S/C14H12N4OS/c1-16-13(19)11-5-3-9(7-17-11)8-2-4-10-12(6-8)20-14(15)18-10/h2-7H,1H3,(H2,15,18)(H,16,19)
n/an/a 3.16E+3n/an/an/an/an/an/a
AstraZeneca
Curated by ChEMBL
Assay Description
Inhibition of N-terminal FLAG-tagged human full length recombinant PI4K3alpha using D-myo-phosphatidylinositol substrate and ATP incubated for 45 min...
Bioorg Med Chem Lett 25: 3189-93 (2015)
BindingDB Entry DOI: 10.7270/Q2KK9DKR
Phosphatidylinositol 4-kinase beta
(Homo sapiens (Human))
BDBM50107276
(CHEMBL3600696)
Show SMILES CNC(=O)c1ccc(cn1)-c1ccc2nc(N)sc2c1
Show InChI InChI=1S/C14H12N4OS/c1-16-13(19)11-5-3-9(7-17-11)8-2-4-10-12(6-8)20-14(15)18-10/h2-7H,1H3,(H2,15,18)(H,16,19)
n/an/a 2.51E+3n/an/an/an/an/an/a
AstraZeneca
Curated by ChEMBL
Assay Description
Inhibition of N-terminal GST-tagged human full length recombinant PI4K3beta expressed in Sf9 cells using D-myo-phosphatidylinositol substrate and ATP...
Bioorg Med Chem Lett 25: 3189-93 (2015)
BindingDB Entry DOI: 10.7270/Q2KK9DKR
Phosphatidylinositol 4,5-bisphosphate 3-kinase catalytic subunit alpha isoform
(Homo sapiens (Human))
BDBM50107276
(CHEMBL3600696)
Show SMILES CNC(=O)c1ccc(cn1)-c1ccc2nc(N)sc2c1
Show InChI InChI=1S/C14H12N4OS/c1-16-13(19)11-5-3-9(7-17-11)8-2-4-10-12(6-8)20-14(15)18-10/h2-7H,1H3,(H2,15,18)(H,16,19)
NCI pathway
Reactome pathway
n/an/a 2.00E+3n/an/an/an/an/an/a
AstraZeneca
Curated by ChEMBL
Assay Description
Inhibition of PI3Kalpha (unknown origin) pre-incubated for 20 mins before phosphatidylinositol 4, 5-bisphosphate substrate addition by kinase-glo plu...
Bioorg Med Chem Lett 25: 3189-93 (2015)
BindingDB Entry DOI: 10.7270/Q2KK9DKR