BDBM50107407 3-(4-Ethoxy-3-fluoro-phenyl)-3-(2-{2-oxo-3-[2-(5,6,7,8-tetrahydro-[1,8]naphthyridin-2-yl)-ethyl]-pyrrolidin-1-yl}-acetylamino)-propionic acid::CHEMBL114362
SMILES: CCOc1ccc(cc1F)[C@H](CC(O)=O)NC(=O)CN1CC[C@H](CCc2ccc3CCCNc3n2)C1=O
InChI Key: InChIKey=FJUFYEBFJYPEFS-AVRDEDQJSA-N
Data: 1 IC50
Activity Spreadsheet -- Enzyme Inhibition Constant Data from BindingDB
Found 1 hit for monomerid = 50107407
Trg + Lig
Ki
nM
ΔG°
kcal/mole
IC50
nM
Kd
nM
EC50/IC50
nM
koff
s-1
kon
M-1s-1
pHTemp
°C
Integrin alpha-V/beta-3
(Homo sapiens (Human))
BDBM50107407
(3-(4-Ethoxy-3-fluoro-phenyl)-3-(2-{2-oxo-3-[2-(5,6...)
Show SMILES CCOc1ccc(cc1F)[C@H](CC(O)=O)NC(=O)CN1CC[C@H](CCc2ccc3CCCNc3n2)C1=O
Show InChI InChI=1S/C27H33FN4O5/c1-2-37-23-10-7-19(14-21(23)28)22(15-25(34)35)31-24(33)16-32-13-11-18(27(32)36)6-9-20-8-5-17-4-3-12-29-26(17)30-20/h5,7-8,10,14,18,22H,2-4,6,9,11-13,15-16H2,1H3,(H,29,30)(H,31,33)(H,34,35)/t18-,22-/m0/s1
n/an/a 0.310n/an/an/an/an/an/a
Merck Research Laboratories
Curated by ChEMBL
Assay Description
Inhibition of high affinity radioligand binding to human alphaV-beta3 integrin
Bioorg Med Chem Lett 12: 31-4 (2001)
BindingDB Entry DOI: 10.7270/Q24J0G8R