BDBM50107411 (S)-3-(2-Oxo-2,3-dihydro-benzooxazol-6-yl)-3-(2-{(S)-2-oxo-3-[2-(5,6,7,8-tetrahydro-[1,8]naphthyridin-2-yl)-ethyl]-pyrrolidin-1-yl}-acetylamino)-propionic acid::CHEMBL114418
SMILES: OC(=O)C[C@H](NC(=O)CN1CC[C@H](CCc2ccc3CCCNc3n2)C1=O)c1ccc2[nH]c(=O)oc2c1
InChI Key: InChIKey=HTULCSBVNFKESE-JXFKEZNVSA-N
Data: 1 IC50
Activity Spreadsheet -- Enzyme Inhibition Constant Data from BindingDB
Found 1 hit for monomerid = 50107411
Trg + Lig
Ki
nM
ΔG°
kcal/mole
IC50
nM
Kd
nM
EC50/IC50
nM
koff
s-1
kon
M-1s-1
pHTemp
°C
ITGAV/ITGB3
(Homo sapiens (Human))
BDBM50107411
((S)-3-(2-Oxo-2,3-dihydro-benzooxazol-6-yl)-3-(2-{(...)
Show SMILES OC(=O)C[C@H](NC(=O)CN1CC[C@H](CCc2ccc3CCCNc3n2)C1=O)c1ccc2[nH]c(=O)oc2c1
Show InChI InChI=1S/C26H29N5O6/c32-22(29-20(13-23(33)34)17-5-8-19-21(12-17)37-26(36)30-19)14-31-11-9-16(25(31)35)4-7-18-6-3-15-2-1-10-27-24(15)28-18/h3,5-6,8,12,16,20H,1-2,4,7,9-11,13-14H2,(H,27,28)(H,29,32)(H,30,36)(H,33,34)/t16-,20-/m0/s1
n/an/a 0.290n/an/an/an/an/an/a
Merck Research Laboratories
Curated by ChEMBL
Assay Description
Inhibition of high affinity radioligand binding to human alphaV-beta3 integrin
Bioorg Med Chem Lett 12: 31-4 (2001)
BindingDB Entry DOI: 10.7270/Q24J0G8R