BDBM50107455 4-Carbamimidoyl-N-{(S)-1-[(S)-3-hydroxy-2-(naphthalene-2-sulfonylamino)-propionyl]-pyrrolidin-2-ylmethyl}-benzamide::CHEMBL423723
SMILES: NC(=N)c1ccc(cc1)C(=O)NC[C@@H]1CCCN1C(=O)[C@H](CO)NS(=O)(=O)c1ccc2ccccc2c1
InChI Key: InChIKey=UFMUGMUVNLIGTI-GMAHTHKFSA-N
Data: 1 IC50
Activity Spreadsheet -- Enzyme Inhibition Constant Data from BindingDB
Found 1 hit for monomerid = 50107455
Trg + Lig
Ki
nM
ΔG°
kcal/mole
IC50
nM
Kd
nM
EC50/IC50
nM
koff
s-1
kon
M-1s-1
pHTemp
°C
Prothrombin
(Homo sapiens (Human))
BDBM50107455
(4-Carbamimidoyl-N-{(S)-1-[(S)-3-hydroxy-2-(naphtha...)
Show SMILES NC(=N)c1ccc(cc1)C(=O)NC[C@@H]1CCCN1C(=O)[C@H](CO)NS(=O)(=O)c1ccc2ccccc2c1
Show InChI InChI=1S/C26H29N5O5S/c27-24(28)18-7-9-19(10-8-18)25(33)29-15-21-6-3-13-31(21)26(34)23(16-32)30-37(35,36)22-12-11-17-4-1-2-5-20(17)14-22/h1-2,4-5,7-12,14,21,23,30,32H,3,6,13,15-16H2,(H3,27,28)(H,29,33)/t21-,23-/m0/s1
n/an/a 13n/an/an/an/an/an/a
Bristol-Myers Squibb Pharmaceutical Research Institute
Curated by ChEMBL
Assay Description
In vitro inhibition of human thrombin catalytic activity after 3 min pre incubation.
Bioorg Med Chem Lett 12: 41-4 (2001)
BindingDB Entry DOI: 10.7270/Q2MP53T0