null
SMILES: Cc1cccc(C[C@H](NC(=O)C(c2ccccc2)c2ccccc2)C(=O)NCC#N)c1
InChI Key: InChIKey=SWPXTIFAGIZWNX-QHCPKHFHSA-N
Activity Spreadsheet -- Enzyme Inhibition Constant Data from BindingDB
Found 4 hits for monomerid = 50107623
Trg + Lig
Ki
nM
ΔG°
kcal/mole
IC50
nM
Kd
nM
EC50/IC50
nM
koff
s-1
kon
M-1s-1
pHTemp
°C
Cathepsin S
(Homo sapiens (Human))
BDBM50107623
(CHEMBL140756 | N-Cyanomethyl-2-diphenylacetylamino...)
Show SMILES Cc1cccc(C[C@H](NC(=O)C(c2ccccc2)c2ccccc2)C(=O)NCC#N)c1
Show InChI InChI=1S/C26H25N3O2/c1-19-9-8-10-20(17-19)18-23(25(30)28-16-15-27)29-26(31)24(21-11-4-2-5-12-21)22-13-6-3-7-14-22/h2-14,17,23-24H,16,18H2,1H3,(H,28,30)(H,29,31)/t23-/m0/s1
Reactome pathway
n/an/a 88n/an/an/an/an/an/a
Novartis Pharmaceuticals Corporation
Curated by ChEMBL
Assay Description
Inhibitiory activity of the compound against recombinant human cathepsin S (cat S) expressed in baculovirus
J Med Chem 44: 4524-34 (2001)
BindingDB Entry DOI: 10.7270/Q2GQ6X2J
Cathepsin B
(Homo sapiens (Human))
BDBM50107623
(CHEMBL140756 | N-Cyanomethyl-2-diphenylacetylamino...)
Show SMILES Cc1cccc(C[C@H](NC(=O)C(c2ccccc2)c2ccccc2)C(=O)NCC#N)c1
Show InChI InChI=1S/C26H25N3O2/c1-19-9-8-10-20(17-19)18-23(25(30)28-16-15-27)29-26(31)24(21-11-4-2-5-12-21)22-13-6-3-7-14-22/h2-14,17,23-24H,16,18H2,1H3,(H,28,30)(H,29,31)/t23-/m0/s1
Reactome pathway
n/an/a 45n/an/an/an/an/an/a
Novartis Pharmaceuticals Corporation
Curated by ChEMBL
Assay Description
Inhibitiory activity against recombinant human cathepsin B (cat B) expressed in baculovirus.
J Med Chem 44: 4524-34 (2001)
BindingDB Entry DOI: 10.7270/Q2GQ6X2J
Cathepsin B
(Homo sapiens (Human))
BDBM50107623
(CHEMBL140756 | N-Cyanomethyl-2-diphenylacetylamino...)
Show SMILES Cc1cccc(C[C@H](NC(=O)C(c2ccccc2)c2ccccc2)C(=O)NCC#N)c1
Show InChI InChI=1S/C26H25N3O2/c1-19-9-8-10-20(17-19)18-23(25(30)28-16-15-27)29-26(31)24(21-11-4-2-5-12-21)22-13-6-3-7-14-22/h2-14,17,23-24H,16,18H2,1H3,(H,28,30)(H,29,31)/t23-/m0/s1
Reactome pathway
n/an/a 87n/an/an/an/an/an/a
Novartis Pharmaceuticals Corporation
Curated by ChEMBL
Assay Description
Inhibitiory activity against recombinant human cathepsin B (cat B) expressed in baculovirus.
J Med Chem 44: 4524-34 (2001)
BindingDB Entry DOI: 10.7270/Q2GQ6X2J
Procathepsin L
(Homo sapiens (Human))
BDBM50107623
(CHEMBL140756 | N-Cyanomethyl-2-diphenylacetylamino...)
Show SMILES Cc1cccc(C[C@H](NC(=O)C(c2ccccc2)c2ccccc2)C(=O)NCC#N)c1
Show InChI InChI=1S/C26H25N3O2/c1-19-9-8-10-20(17-19)18-23(25(30)28-16-15-27)29-26(31)24(21-11-4-2-5-12-21)22-13-6-3-7-14-22/h2-14,17,23-24H,16,18H2,1H3,(H,28,30)(H,29,31)/t23-/m0/s1
Reactome pathway
n/an/a 6n/an/an/an/an/an/a
Novartis Pharmaceuticals Corporation
Curated by ChEMBL
Assay Description
Inhibitiory activity of the compound against recombinant human cathepsin L (cat L) expressed in baculovirus
J Med Chem 44: 4524-34 (2001)
BindingDB Entry DOI: 10.7270/Q2GQ6X2J