BDBM50107708 1,6-di[4-(1-methyl-1,2,3,6-tetrahydro-5-pyridinyl)-1,2,5-thiadiazol-3-yloxy]hexane::CHEMBL142126
SMILES: CN1CCC=C(C1)c1nsnc1OCCCCCCOc1nsnc1C1=CCCN(C)C1
InChI Key: InChIKey=BVWNSRHZVHDVLM-UHFFFAOYSA-N
Data: 1 KI  1 EC50
Activity Spreadsheet -- Enzyme Inhibition Constant Data from BindingDB
Found 2 hits for monomerid = 50107708
Trg + Lig
Ki
nM
ΔG°
kcal/mole
IC50
nM
Kd
nM
EC50/IC50
nM
koff
s-1
kon
M-1s-1
pHTemp
°C
Muscarinic acetylcholine receptor M1
(Homo sapiens (Human))
BDBM50107708
(1,6-di[4-(1-methyl-1,2,3,6-tetrahydro-5-pyridinyl)...)
Show SMILES CN1CCC=C(C1)c1nsnc1OCCCCCCOc1nsnc1C1=CCCN(C)C1 |c:4,t:28|
Show InChI InChI=1S/C22H32N6O2S2/c1-27-11-7-9-17(15-27)19-21(25-31-23-19)29-13-5-3-4-6-14-30-22-20(24-32-26-22)18-10-8-12-28(2)16-18/h9-10H,3-8,11-16H2,1-2H3
0.610n/an/an/an/an/an/an/an/a
The University of Toledo
Curated by ChEMBL
Assay Description
Binding affinity towards M1 muscarinic receptor expressed in A9 L cells by diaplacing [3H]-(R)-QNB radioligand.
J Med Chem 44: 4563-76 (2001)
BindingDB Entry DOI: 10.7270/Q2765DN7
Muscarinic acetylcholine receptor M4
(Homo sapiens (Human))
BDBM50107708
(1,6-di[4-(1-methyl-1,2,3,6-tetrahydro-5-pyridinyl)...)
Show SMILES CN1CCC=C(C1)c1nsnc1OCCCCCCOc1nsnc1C1=CCCN(C)C1 |c:4,t:28|
Show InChI InChI=1S/C22H32N6O2S2/c1-27-11-7-9-17(15-27)19-21(25-31-23-19)29-13-5-3-4-6-14-30-22-20(24-32-26-22)18-10-8-12-28(2)16-18/h9-10H,3-8,11-16H2,1-2H3
Reactome pathway
n/an/an/an/a>1.00E+5n/an/an/an/a
The University of Toledo
Curated by ChEMBL
Assay Description
Agonist activity against M4 muscarinic receptor expressed in RBL-2H3 Mast cells.
J Med Chem 44: 4563-76 (2001)
BindingDB Entry DOI: 10.7270/Q2765DN7