null
SMILES: CC1CCN(CCOc2ccc(cc2)C#Cc2ccc(cn2)-c2ccc(Cl)cc2)CC1
InChI Key: InChIKey=UWQLUXHEVKAZSK-UHFFFAOYSA-N
Activity Spreadsheet -- Enzyme Inhibition Constant Data from BindingDB
Found 4 hits for monomerid = 50107747
Trg + Lig
Ki
nM
ΔG°
kcal/mole
IC50
nM
Kd
nM
EC50/IC50
nM
koff
s-1
kon
M-1s-1
pHTemp
°C
Muscarinic acetylcholine receptor M1
(Homo sapiens (Human))
BDBM50107747
(CHEMBL3600830)
Show SMILES CC1CCN(CCOc2ccc(cc2)C#Cc2ccc(cn2)-c2ccc(Cl)cc2)CC1
Show InChI InChI=1S/C27H27ClN2O/c1-21-14-16-30(17-15-21)18-19-31-27-12-3-22(4-13-27)2-10-26-11-7-24(20-29-26)23-5-8-25(28)9-6-23/h3-9,11-13,20-21H,14-19H2,1H3
n/an/a 2.21E+3n/an/an/an/an/an/a
Boehringer Ingelheim Pharma GmbH& Co. KG
Curated by ChEMBL
Assay Description
Inhibition of muscarinic M1 receptor (unknown origin)
Bioorg Med Chem Lett 25: 3264-9 (2015)
BindingDB Entry DOI: 10.7270/Q25D8TMB
Melanin-concentrating hormone receptor 1
(Homo sapiens (Human))
BDBM50107747
(CHEMBL3600830)
Show SMILES CC1CCN(CCOc2ccc(cc2)C#Cc2ccc(cn2)-c2ccc(Cl)cc2)CC1
Show InChI InChI=1S/C27H27ClN2O/c1-21-14-16-30(17-15-21)18-19-31-27-12-3-22(4-13-27)2-10-26-11-7-24(20-29-26)23-5-8-25(28)9-6-23/h3-9,11-13,20-21H,14-19H2,1H3
Reactome pathway
n/an/a 5n/an/an/an/an/an/a
Boehringer Ingelheim Pharma GmbH& Co. KG
Curated by ChEMBL
Assay Description
Displacement of [125I]-MCH from human MCHR1 expressed in CHO/Galpha16 cell membranes by scintillation counting method
Bioorg Med Chem Lett 25: 3264-9 (2015)
BindingDB Entry DOI: 10.7270/Q25D8TMB
Cytochrome P450 2D6
(Homo sapiens (Human))
BDBM50107747
(CHEMBL3600830)
Show SMILES CC1CCN(CCOc2ccc(cc2)C#Cc2ccc(cn2)-c2ccc(Cl)cc2)CC1
Show InChI InChI=1S/C27H27ClN2O/c1-21-14-16-30(17-15-21)18-19-31-27-12-3-22(4-13-27)2-10-26-11-7-24(20-29-26)23-5-8-25(28)9-6-23/h3-9,11-13,20-21H,14-19H2,1H3
n/an/a>1.00E+4n/an/an/an/an/an/a
Boehringer Ingelheim Pharma GmbH& Co. KG
Curated by ChEMBL
Assay Description
Inhibition of CYP2D6 receptor (unknown origin)
Bioorg Med Chem Lett 25: 3264-9 (2015)
BindingDB Entry DOI: 10.7270/Q25D8TMB
5-hydroxytryptamine receptor 2A
(Homo sapiens (Human))
BDBM50107747
(CHEMBL3600830)
Show SMILES CC1CCN(CCOc2ccc(cc2)C#Cc2ccc(cn2)-c2ccc(Cl)cc2)CC1
Show InChI InChI=1S/C27H27ClN2O/c1-21-14-16-30(17-15-21)18-19-31-27-12-3-22(4-13-27)2-10-26-11-7-24(20-29-26)23-5-8-25(28)9-6-23/h3-9,11-13,20-21H,14-19H2,1H3
Reactome pathway
n/an/a 1.35E+3n/an/an/an/an/an/a
Boehringer Ingelheim Pharma GmbH& Co. KG
Curated by ChEMBL
Assay Description
Inhibition of 5HT2A receptor (unknown origin)
Bioorg Med Chem Lett 25: 3264-9 (2015)
BindingDB Entry DOI: 10.7270/Q25D8TMB