null
SMILES: Clc1ccc(cc1)-c1ccc(nc1)C#Cc1ccc(OCCN2CCCC2)c(Cl)c1
InChI Key: InChIKey=DGYRGGYLBSICLJ-UHFFFAOYSA-N
Activity Spreadsheet -- Enzyme Inhibition Constant Data from BindingDB
Found 1 hit for monomerid = 50107754
Trg + Lig
Ki
nM
ΔG°
kcal/mole
IC50
nM
Kd
nM
EC50/IC50
nM
koff
s-1
kon
M-1s-1
pHTemp
°C
Melanin-concentrating hormone receptor 1
(Homo sapiens (Human))
BDBM50107754
(CHEMBL3601017)
Show SMILES Clc1ccc(cc1)-c1ccc(nc1)C#Cc1ccc(OCCN2CCCC2)c(Cl)c1
Show InChI InChI=1S/C25H22Cl2N2O/c26-22-8-5-20(6-9-22)21-7-11-23(28-18-21)10-3-19-4-12-25(24(27)17-19)30-16-15-29-13-1-2-14-29/h4-9,11-12,17-18H,1-2,13-16H2
Reactome pathway
n/an/a 5n/an/an/an/an/an/a
Boehringer Ingelheim Pharma GmbH& Co. KG
Curated by ChEMBL
Assay Description
Displacement of [125I]-MCH from human MCHR1 expressed in CHO/Galpha16 cell membranes by scintillation counting method
Bioorg Med Chem Lett 25: 3264-9 (2015)
BindingDB Entry DOI: 10.7270/Q25D8TMB