BDBM50107808 6-Methyl-4'-trifluoromethyl-biphenyl-2-carboxylic acid [2-(thiophene-2-sulfonylamino)-indan-5-yl]-amide::CHEMBL336873
SMILES: Cc1cccc(C(=O)Nc2ccc3C[C@H](Cc3c2)NS(=O)(=O)c2cccs2)c1-c1ccc(cc1)C(F)(F)F
InChI Key: InChIKey=NXEKMMKJEQUKOX-HSZRJFAPSA-N
Data: 2 IC50
Activity Spreadsheet -- Enzyme Inhibition Constant Data from BindingDB
Found 2 hits for monomerid = 50107808
Trg + Lig
Ki
nM
ΔG°
kcal/mole
IC50
nM
Kd
nM
EC50/IC50
nM
koff
s-1
kon
M-1s-1
pHTemp
°C
Apolipoprotein B-100
(Homo sapiens (Human))
BDBM50107808
(6-Methyl-4'-trifluoromethyl-biphenyl-2-carboxylic ...)
Show SMILES Cc1cccc(C(=O)Nc2ccc3C[C@H](Cc3c2)NS(=O)(=O)c2cccs2)c1-c1ccc(cc1)C(F)(F)F
Show InChI InChI=1S/C28H23F3N2O3S2/c1-17-4-2-5-24(26(17)18-7-10-21(11-8-18)28(29,30)31)27(34)32-22-12-9-19-14-23(16-20(19)15-22)33-38(35,36)25-6-3-13-37-25/h2-13,15,23,33H,14,16H2,1H3,(H,32,34)/t23-/m1/s1
NCI pathway
Reactome pathway
n/an/a 0.900n/an/an/an/an/an/a
Novartis Institute for Biomedical Reasearch
Curated by ChEMBL
Assay Description
Inhibition of apolipoprotein B (apoB) secreted by human hepatoma cells (Hep G2) at 100 nM
J Med Chem 44: 4677-87 (2001)
BindingDB Entry DOI: 10.7270/Q23F4NXH
Microsomal triglyceride transfer protein
(Homo sapiens (Human))
BDBM50107808
(6-Methyl-4'-trifluoromethyl-biphenyl-2-carboxylic ...)
Show SMILES Cc1cccc(C(=O)Nc2ccc3C[C@H](Cc3c2)NS(=O)(=O)c2cccs2)c1-c1ccc(cc1)C(F)(F)F
Show InChI InChI=1S/C28H23F3N2O3S2/c1-17-4-2-5-24(26(17)18-7-10-21(11-8-18)28(29,30)31)27(34)32-22-12-9-19-14-23(16-20(19)15-22)33-38(35,36)25-6-3-13-37-25/h2-13,15,23,33H,14,16H2,1H3,(H,32,34)/t23-/m1/s1
Reactome pathway
n/an/a 50n/an/an/an/an/an/a
Novartis Institute for Biomedical Reasearch
Curated by ChEMBL
Assay Description
In vitro inhibitory activity against MTP using MTP transfer assay
J Med Chem 44: 4677-87 (2001)
BindingDB Entry DOI: 10.7270/Q23F4NXH