BDBM50108159 CHEMBL75302::N-[2-[4-(4-Chloro-phenoxy)-benzenesulfonyl]-1-(4,4-dimethyl-2,5-dioxo-imidazolidin-1-ylmethyl)-ethyl]-N-hydroxy-formamide
SMILES: CC1(C)NC(=O)N(CC(CS(=O)(=O)c2ccc(Oc3ccc(Cl)cc3)cc2)N(O)C=O)C1=O
InChI Key: InChIKey=LSWGUPLJLWZCIM-UHFFFAOYSA-N
Data: 4 IC50
Activity Spreadsheet -- Enzyme Inhibition Constant Data from BindingDB
Found 4 hits for monomerid = 50108159
Trg + Lig
Ki
nM
ΔG°
kcal/mole
IC50
nM
Kd
nM
EC50/IC50
nM
koff
s-1
kon
M-1s-1
pHTemp
°C
Matrix metalloproteinase-9
(Homo sapiens (Human))
BDBM50108159
(CHEMBL75302 | N-[2-[4-(4-Chloro-phenoxy)-benzenesu...)
Show SMILES CC1(C)NC(=O)N(CC(CS(=O)(=O)c2ccc(Oc3ccc(Cl)cc3)cc2)N(O)C=O)C1=O
Show InChI InChI=1S/C21H22ClN3O7S/c1-21(2)19(27)24(20(28)23-21)11-15(25(29)13-26)12-33(30,31)18-9-7-17(8-10-18)32-16-5-3-14(22)4-6-16/h3-10,13,15,29H,11-12H2,1-2H3,(H,23,28)
Reactome pathway
n/an/a 0.960n/an/an/an/an/an/a
Abbott Laboratories
Curated by ChEMBL
Assay Description
In vitro selective inhibition against Matrix metalloprotease-9 (MMP-9) using fluorimetric assay
J Med Chem 45: 219-32 (2001)
BindingDB Entry DOI: 10.7270/Q2XP747B
Matrix metalloproteinase-9
(Homo sapiens (Human))
BDBM50108159
(CHEMBL75302 | N-[2-[4-(4-Chloro-phenoxy)-benzenesu...)
Show SMILES CC1(C)NC(=O)N(CC(CS(=O)(=O)c2ccc(Oc3ccc(Cl)cc3)cc2)N(O)C=O)C1=O
Show InChI InChI=1S/C21H22ClN3O7S/c1-21(2)19(27)24(20(28)23-21)11-15(25(29)13-26)12-33(30,31)18-9-7-17(8-10-18)32-16-5-3-14(22)4-6-16/h3-10,13,15,29H,11-12H2,1-2H3,(H,23,28)
Reactome pathway
n/an/a 37n/an/an/an/an/an/a
TBA
Curated by ChEMBL
Assay Description
Inhibition of MMP9
ACS Med Chem Lett 2: 455-460 (2011)
Article DOI: 10.1021/ml200031m
BindingDB Entry DOI: 10.7270/Q2HQ40ZK
Interstitial collagenase
(Homo sapiens (Human))
BDBM50108159
(CHEMBL75302 | N-[2-[4-(4-Chloro-phenoxy)-benzenesu...)
Show SMILES CC1(C)NC(=O)N(CC(CS(=O)(=O)c2ccc(Oc3ccc(Cl)cc3)cc2)N(O)C=O)C1=O
Show InChI InChI=1S/C21H22ClN3O7S/c1-21(2)19(27)24(20(28)23-21)11-15(25(29)13-26)12-33(30,31)18-9-7-17(8-10-18)32-16-5-3-14(22)4-6-16/h3-10,13,15,29H,11-12H2,1-2H3,(H,23,28)
Reactome pathway
n/an/a 90n/an/an/an/an/an/a
Abbott Laboratories
Curated by ChEMBL
Assay Description
In vitro selective inhibition against matrix metalloprotease-1 (MMP-1) using a fluorimetric assay
J Med Chem 45: 219-32 (2001)
BindingDB Entry DOI: 10.7270/Q2XP747B
72 kDa type IV collagenase
(Homo sapiens (Human))
BDBM50108159
(CHEMBL75302 | N-[2-[4-(4-Chloro-phenoxy)-benzenesu...)
Show SMILES CC1(C)NC(=O)N(CC(CS(=O)(=O)c2ccc(Oc3ccc(Cl)cc3)cc2)N(O)C=O)C1=O
Show InChI InChI=1S/C21H22ClN3O7S/c1-21(2)19(27)24(20(28)23-21)11-15(25(29)13-26)12-33(30,31)18-9-7-17(8-10-18)32-16-5-3-14(22)4-6-16/h3-10,13,15,29H,11-12H2,1-2H3,(H,23,28)
Reactome pathway
n/an/a 0.320n/an/an/an/an/an/a
Abbott Laboratories
Curated by ChEMBL
Assay Description
In vitro selective inhibition against matrix metalloprotease-2 (MMP-2) using fluorimetric assay
J Med Chem 45: 219-32 (2001)
BindingDB Entry DOI: 10.7270/Q2XP747B