BDBM50108606 Aminoharnstoff::CHEMBL903::Carbamidsaeurehydrazid::Semikarbazid::carbamylhydrazine::carbazamide::hydrazinecarboxamide::semicarbazide
SMILES: NNC(N)=O
InChI Key: InChIKey=DUIOPKIIICUYRZ-UHFFFAOYSA-N
Data: 3 IC50
Activity Spreadsheet -- Enzyme Inhibition Constant Data from BindingDB
Found 3 hits for monomerid = 50108606
Trg + Lig
Ki
nM
ΔG°
kcal/mole
IC50
nM
Kd
nM
EC50/IC50
nM
koff
s-1
kon
M-1s-1
pHTemp
°C
Amine oxidase [flavin-containing] B
(Homo sapiens (Human))
BDBM50108606
(Aminoharnstoff | CHEMBL903 | Carbamidsaeurehydrazi...)
Show SMILES NNC(N)=O
Show InChI InChI=1S/CH5N3O/c2-1(5)4-3/h3H2,(H3,2,4,5)
n/an/a 6.70n/an/an/an/an/an/a
National Institute of Diabetes and Digestive and Kidney Diseases
Curated by ChEMBL
Assay Description
Compound was evaluated for inhibition of Microbial tyramine oxidase
J Med Chem 47: 1796-806 (2004)
Article DOI: 10.1021/jm030398k
BindingDB Entry DOI: 10.7270/Q21G0N12
Amine oxidase (flavin-containing) A
(Homo sapiens (Human))
BDBM50108606
(Aminoharnstoff | CHEMBL903 | Carbamidsaeurehydrazi...)
Show SMILES NNC(N)=O
Show InChI InChI=1S/CH5N3O/c2-1(5)4-3/h3H2,(H3,2,4,5)
n/an/a 6.70E+3n/an/an/an/an/an/a
Universit£t M£nster
Curated by ChEMBL
Assay Description
Inhibitory concentration for human liver monoamine oxidase A
J Med Chem 47: 5860-71 (2004)
Article DOI: 10.1021/jm049957t
BindingDB Entry DOI: 10.7270/Q2KH0P44
Amine oxidase [flavin-containing] B
(Homo sapiens (Human))
BDBM50108606
(Aminoharnstoff | CHEMBL903 | Carbamidsaeurehydrazi...)
Show SMILES NNC(N)=O
Show InChI InChI=1S/CH5N3O/c2-1(5)4-3/h3H2,(H3,2,4,5)
n/an/a 6.70E+3n/an/an/an/an/an/a
Universit£t M£nster
Curated by ChEMBL
Assay Description
Inhibitory concentration for human liver monoamine oxidase B
J Med Chem 47: 5860-71 (2004)
Article DOI: 10.1021/jm049957t
BindingDB Entry DOI: 10.7270/Q2KH0P44