BDBM50108762 1-(4-{4-[2-(2-Hydroxy-ethyl)-pyrimidin-4-yl]-2,6-dimethyl-piperazin-1-yl}-pyrimidin-2-yl)-ethanol::CHEMBL151017
SMILES: C[C@@H](O)c1nccc(n1)N1[C@@H](C)CN(C[C@H]1C)c1ccnc(CCO)n1
InChI Key: InChIKey=PODSAVKUTSHBKN-HZSPNIEDSA-N
Data: 1 IC50
Activity Spreadsheet -- Enzyme Inhibition Constant Data from BindingDB
Found 1 hit for monomerid = 50108762
Trg + Lig
Ki
nM
ΔG°
kcal/mole
IC50
nM
Kd
nM
EC50/IC50
nM
koff
s-1
kon
M-1s-1
pHTemp
°C
Sorbitol dehydrogenase
(Homo sapiens (Human))
BDBM50108762
(1-(4-{4-[2-(2-Hydroxy-ethyl)-pyrimidin-4-yl]-2,6-d...)
Show SMILES C[C@@H](O)c1nccc(n1)N1[C@@H](C)CN(C[C@H]1C)c1ccnc(CCO)n1
Show InChI InChI=1S/C18H26N6O2/c1-12-10-23(16-4-7-19-15(21-16)6-9-25)11-13(2)24(12)17-5-8-20-18(22-17)14(3)26/h4-5,7-8,12-14,25-26H,6,9-11H2,1-3H3/t12-,13+,14-/m1/s1
n/an/a 10n/an/an/an/an/an/a
Pfizer Global Research and Development
Curated by ChEMBL
Assay Description
Concentration required for 50% in vitro inhibition of recombinant human sorbitol dehydrogenase (h-SDH)
J Med Chem 45: 511-28 (2002)
BindingDB Entry DOI: 10.7270/Q2R210QX